{"text_format":"1","workbook":"xlsx","n_sheets":9,"sheets":["Building Consent Fee Summary","PIM Only Consent Fee Summary","Scanning | Printing Calculator","Connect Amendment Input Calcs","Scanning Calculations","Dropdowns","Names of Officers","DedupedNames","Role Fee Structure"],"not_rendered":{"charts":0,"images":2,"macros":1,"external_links":0,"defined_names":7,"comments":0,"pivot_tables":0},"unopened":[],"bounds":{"document_bytes":16777216,"sheet_cells":100000,"rows_first":2000,"rows_last":500,"rows_between":2000,"halvings":0,"cell_chars":16384,"cell_head_chars":4096},"cells_cut":0,"cells_raw":0,"read":"whole","date_system":"1900"}

{"sheet":"Building Consent Fee Summary","index":0,"n_rows":99,"n_cols":26,"rows_kept":99,"cut":false,"hidden":false,"merged":[[49,0,49,2],[50,4,50,5],[46,8,46,10],[39,3,39,4],[42,3,42,4],[69,6,70,6],[69,0,70,5],[63,4,63,5],[55,4,55,5],[53,2,53,3],[54,2,54,3],[53,4,53,5],[54,4,54,5],[67,0,67,5],[57,0,57,6],[59,1,59,3],[60,1,60,3],[65,0,65,5],[75,1,75,5],[2,0,2,4],[52,0,52,6],[47,0,47,2],[48,0,48,2],[46,0,46,2],[13,2,13,4],[4,5,4,6],[6,0,6,6],[11,0,11,6],[16,0,16,6],[21,0,21,6],[44,0,44,6],[41,3,41,4],[38,3,38,4],[4,3,4,4],[92,1,92,4],[94,1,94,4],[96,1,96,4],[98,1,98,4],[87,1,87,4],[90,1,90,4],[91,1,91,4],[88,1,88,5]]}
[]
[]
["Consent Fee Summary (Building Consent)"]
[]
["Consent Reference Number:","BCN/2017/2013/B","Consent Address:","80 Byron Street",null,"B103 LU: 01.07.20 LR: 01.07.20 v28"]
[]
["Accept:"]
["Type:","Comments:","Officer Name: ","Date: ","Hours Worked:","Rate Per Hour:","Fee:"]
["Lodging",null,"Bruce Lyon","2020-07-01",0.33,{"$f":"IF(C9=\"\",\" \",SUMPRODUCT((Z9=OFFSET('Role Fee Structure'!$C$4,0,0,'Role Fee Structure'!$AB$5))*(W9=OFFSET('Role Fee Structure'!$F$2,0,0,1,'Role Fee Structure'!$AB$4))*(D9>=OFFSET('Role Fee Structure'!$D$4,0,0,'Role Fee Structure'!$AB$5))*(D9<=OFFSET('Role Fee Structure'!$E$4,0,0,'Role Fee Structure'!$AB$5))*(OFFSET('Role Fee Structure'!$F$4,0,0,'Role Fee Structure'!$AB$5,'Role Fee Structure'!$AB$4))))","v":120},{"$f":"IF(C9=\"\", \" \",$E9*$F9)","v":39.6},null,null,null,null,{"$f":"$A$7","v":"Accept:"},null,null,null,null,null,null,null,null,null,"Financial Year",{"$f":"TEXT(IF(MONTH(D9)>6,YEAR(D9)+1,YEAR(D9)),\"####\")","v":"2021"},null,"Role Type",{"$f":"SUMPRODUCT((C9=OFFSET('Names of Officers'!$B$4,0,0,'Names of Officers'!$AB$6))*(D9>=OFFSET('Names of Officers'!$D$4,0,0,'Names of Officers'!$AB$6))*(D9<=OFFSET('Names of Officers'!$E$4,0,0,'Names of Officers'!$AB$6))*(OFFSET('Names of Officers'!$F$4,0,0,'Names of Officers'!$AB$6)))","v":59}]
[null," ",null,null,null,"Total Fee:",{"$f":"SUMIF($L:$L,$A$7,$G:$G)","v":39.6}]
[null,null," "]
["PIM/Development Check:"]
["Type:","Comments:","Officer Name: ","Date: ","Hours Worked:","Rate Per Hour:","Fee:"]
["PIM Coordinator Sign-off"," ",null,null,null,"Not Applicable",{"$f":"VLOOKUP(F14,PIMCOORD[#All],2,0)","v":0},null,null,null,null,{"$f":"$A$12","v":"PIM/Development Check:"}]
[null,null,null,null,null,"Total Fee:",{"$f":"SUMIF($L:$L,$A$12,$G:$G)","v":0}]
[null," "]
["Pre-acceptance Technical Review:"]
["Type:","Comments:","Officer Name: ","Date: ","Hours Worked:","Rate Per Hour:","Fee:"]
["Pre-acceptance technical review",null,"Michelle-Anne Reddock","2020-06-30",0.83,{"$f":"IF(C19=\"\",\" \",SUMPRODUCT((Z19=OFFSET('Role Fee Structure'!$C$4,0,0,'Role Fee Structure'!$AB$5))*(W19=OFFSET('Role Fee Structure'!$F$2,0,0,1,'Role Fee Structure'!$AB$4))*(D19>=OFFSET('Role Fee Structure'!$D$4,0,0,'Role Fee Structure'!$AB$5))*(D19<=OFFSET('Role Fee Structure'!$E$4,0,0,'Role Fee Structure'!$AB$5))*(OFFSET('Role Fee Structure'!$F$4,0,0,'Role Fee Structure'!$AB$5,'Role Fee Structure'!$AB$4))))","v":180},{"$f":"IF(C19=\"\", \" \",$E19*$F19)","v":149.4},null,null,null,null,{"$f":"$A$17","v":"Pre-acceptance Technical Review:"},null,null,null,null,null,null,null,null,null,"Financial Year",{"$f":"TEXT(IF(MONTH(D19)>6,YEAR(D19)+1,YEAR(D19)),\"####\")","v":"2020"},null,"Role Type",{"$f":"SUMPRODUCT((C19=OFFSET('Names of Officers'!$B$4,0,0,'Names of Officers'!$AB$6))*(D19>=OFFSET('Names of Officers'!$D$4,0,0,'Names of Officers'!$AB$6))*(D19<=OFFSET('Names of Officers'!$E$4,0,0,'Names of Officers'!$AB$6))*(OFFSET('Names of Officers'!$F$4,0,0,'Names of Officers'!$AB$6)))","v":81}]
[null," "," ",null,null,"Total Fee:",{"$f":"SUMIF($L:$L,$A$17,$G:$G)","v":149.4}]
{"$rows_left_out":80}
{"sheet":"PIM Only Consent Fee Summary","index":1,"n_rows":17,"n_cols":27,"rows_kept":17,"cut":false,"hidden":false,"merged":[[4,5,4,6],[2,0,2,4],[14,0,14,5],[16,0,17,5],[16,6,17,6],[12,3,12,4],[6,0,6,6],[11,3,11,4],[4,3,4,4]]}
[]
[]
["Consent Fee Summary (PIM Only)"]
[]
["Consent Reference Number:","BCN/201X/XXXX","Consent Address:","ENTER ADDRESS",null,"B103 LU: 01.07.20 LR: 01.07.20 v28"]
[]
["PIM/Development Check "]
["Type:","Comments:","Officer Name:","Date:","Hours Worked:","Rate Per Hour:","Fee:"]
["< Please Select >",null,"Please Select","2015-07-01",0,{"$f":"IF(C9=\"\",\" \",SUMPRODUCT((AA9=OFFSET('Role Fee Structure'!$C$4,0,0,'Role Fee Structure'!$AB$5))*(X9=OFFSET('Role Fee Structure'!$F$2,0,0,1,'Role Fee Structure'!$AB$4))*(D9>=OFFSET('Role Fee Structure'!$D$4,0,0,'Role Fee Structure'!$AB$5))*(D9<=OFFSET('Role Fee Structure'!$E$4,0,0,'Role Fee Structure'!$AB$5))*(OFFSET('Role Fee Structure'!$F$4,0,0,'Role Fee Structure'!$AB$5,'Role Fee Structure'!$AB$4))))","v":0},{"$f":"IF(C9=\"\", \" \",$E9*$F9)","v":0},null,null,null,null,{"$f":"$A$7","v":"PIM/Development Check "},null,null,null,null,null,null,null,null,null,null,"Financial Year",{"$f":"TEXT(IF(MONTH(D9)>6,YEAR(D9)+1,YEAR(D9)),\"####\")","v":"2016"},null,"Role Type",{"$f":"SUMPRODUCT((C9=OFFSET('Names of Officers'!$B$4,0,0,'Names of Officers'!$AB$6))*(D9>=OFFSET('Names of Officers'!$D$4,0,0,'Names of Officers'!$AB$6))*(D9<=OFFSET('Names of Officers'!$E$4,0,0,'Names of Officers'!$AB$6))*(OFFSET('Names of Officers'!$F$4,0,0,'Names of Officers'!$AB$6)))","v":0}]
[null," ",null,"Certificate of Title:",0,"Not Applicable",{"$f":"IF(AND(F10=\"Applicable\",E10<1),\"CHECK\",E10*X10)","v":0},null,null,null,null,{"$f":"$A$7","v":"PIM/Development Check "},null,null,null,null,null,null,null,null,null,null,null,{"$f":"VLOOKUP(F10,CT[#All],2,0)","v":0}]
[null,null,null,"PIM Coordinator Sign Off",null,"Applicable",{"$f":"VLOOKUP(F11,PIMCOORD[#All],2,0)","v":30},null,null,null,null,"PIM/Development Check "]
[null,null,null,"Electronic File Management Fee",null,"Applicable",{"$f":"VLOOKUP(F12,ElectronicFile[#All],2,0)","v":52},null,null,null,null,"PIM/Development Check "]
[null,null,null,"Total Fee:",null,null,{"$f":"SUMIF($L:$L,$A$7,$G:$G)","v":82}]
[]
["Less Deposit Paid (inc GST):",null,null,null,null,null,0]
[]
["Total Invoice (inc GST):",null,null,null,null,null,{"$f":"SUM(G13-G15)","v":82}]

{"sheet":"Scanning | Printing Calculator","index":2,"n_rows":17,"n_cols":2,"rows_kept":17,"cut":false,"hidden":false,"merged":[[3,0,3,1]]}
[]
[]
["Scanning"]
["Received: "]
["No. of pages: A4/A3",0]
["No. of pages: A2/Larger",0]
[]
[]
["Printing"]
["No. of pages: A4",0]
["No. of pages: A3",0]
["No. of pages: A2",0]
["No. of pages: A1",0]
[]
[]
["Total Scanning Charge:",{"$f":"'Scanning Calculations'!C8","v":0}]
["Total Printing Charge:",{"$f":"'Scanning Calculations'!O8","v":0}]

{"sheet":"Connect Amendment Input Calcs","index":3,"n_rows":6,"n_cols":9,"rows_kept":6,"cut":false,"hidden":false,"merged":[[0,1,0,8]]}
[null,"(For Connect Input Only) Levies:"]
[]
[null,null,"New levies","Original levies","Amendment 1 levies","Amendment 2 levies","Amendment 3 levies","Total previous levies","Difference (Adjust by these amounts)"]
[null,"Accreditation Levy",null,null,null,null,null,{"$f":"SUM(D4:G4)","v":0},{"$f":"C4-H4","v":0}]
[null,"Building Levy",null,null,null,null,null,{"$f":"SUM(D5:G5)","v":0},{"$f":"C5-H5","v":0}]
[null,"Building Research Levy",null,null,null,null,null,0,0]

{"sheet":"Scanning Calculations","index":4,"n_rows":38,"n_cols":15,"rows_kept":38,"cut":false,"hidden":true,"merged":[[4,4,4,6]]}
["DO NOT EDIT THE RED CELLS",null,null,null,null,null,null,null,null,null,null,null,"Printing Calculations"]
[]
["Changes to the Scanning Fees can be made by editing the yellow cells. These changes will automatically feed through to the calculation formulae.",null,null,null,null,null,null,null,null,null,null,null,"A4",{"$f":"'Scanning | Printing Calculator'!B10","v":0},{"$f":"N3*0.2","v":0}]
[null,null,null,null,null,null,null,null,null,null,null,null,"A3",{"$f":"'Scanning | Printing Calculator'!B11","v":0},{"$f":"N4*2","v":0}]
[null,"No. of pages",null,null,"Scanning Fees",null,null,null,null,null,null,null,"A2",{"$f":"'Scanning | Printing Calculator'!B12","v":0},{"$f":"N5*3.5","v":0}]
[null,"A3/A4",{"$f":"'Scanning | Printing Calculator'!B5","v":0},null,"No. of pages","Size","Cost (inc. GST)",null,null,null,null,null,"A1",{"$f":"'Scanning | Printing Calculator'!B13","v":0},{"$f":"N6*6.5","v":0}]
[null,"A2/Larger",{"$f":"'Scanning | Printing Calculator'!B6","v":0},null,"1 to 20","A3/A4",27.4]
[null,"TOTAL COST",{"$f":"C10+C14","v":0},null,"21 to 40","A3/A4",29.5,null,null,null,null,null,"Total",null,{"$f":"SUM(O3:O6)","v":0}]
[null,null,null,null,"41 to 60","A3/A4",33.5]
[null,"Calculations",{"$f":"IF(AND(C6>0,C6<21),G7,IF(AND(C6>20,C6<41),G8,IF(AND(C6>40,C6<61),G9,IF(AND(C6>60,C6<81),G10,IF(AND(C6>80,C6<101),G11,IF(AND(C6>100,C6<151),G12,IF(AND(C6>150,C6<251),G13,C11)))))))","v":0},null,"61 to 80","A3/A4",37.9]
[null,"A3/A4",{"$f":"IF(AND(C6>250,C6<351),G14,IF(AND(C6>350,C6<451),G15,IF(AND(C6>450,C6<551),G16,IF(AND(C6>550,C6<651),G17,IF(AND(C6>650,C6<751),G18,IF(AND(C6>750,C6<851),G19,IF(AND(C6>850,C6<951),G20,C12)))))))","v":0},null,"81 to 100","A3/A4",42]
[null,null,{"$f":"IF(AND(C6>951),G21,0)","v":0},null,"101 to 150","A3/A4",49.5]
[null,null,null,null,"151 to 250","A3/A4",70.5]
[null,"Calculations",{"$f":"IF(AND(C7>0,C7<21),G24,IF(AND(C7>20,C7<41),G25,IF(AND(C7>40,C7<61),G26,IF(AND(C7>60,C7<81),G27,IF(AND(C7>80,C7<101),G28,IF(AND(C7>100,C7<151),G29,IF(AND(C7>150,C7<251),G30,C15)))))))","v":0},null,"251 to 350","A3/A4",141]
[null,"A2 or Larger",{"$f":"IF(AND(C7>250,C7<351),G31,IF(AND(C7>350,C7<451),G32,IF(AND(C7>450,C7<551),G33,IF(AND(C7>550,C7<651),G34,IF(AND(C7>650,C7<751),G35,IF(AND(C7>750,C7<851),G36,IF(AND(C7>850,C7<951),G37,C16)))))))","v":0},null,"351 to 450","A3/A4",211.5]
[null,null,{"$f":"IF(AND(C7>951),G38,0)","v":0},null,"451 to 550","A3/A4",282]
[null,null,null,null,"551 to 650","A3/A4",352.5]
[null,null,null,null,"651 to 750","A3/A4",423]
[null,null,null,null,"751 to 850","A3/A4",493.5]
[null,null,null,null,"851 to 950","A3/A4",564]
{"$rows_left_out":19}
{"sheet":"Dropdowns","index":5,"n_rows":33,"n_cols":17,"rows_kept":33,"cut":false,"hidden":true,"merged":[]}
["< Please Select >",null,"< Please Select >",null,"< Please Select >",null,"Inspection Type","Charge",null,null,null,"IssueConsent","Charge",null,null,"ItemNum","Charge"]
["Lodging",null,"Building (Hazards) Check",null,"Vetting",null,"< Please Select >",0,null,null,null,"Applicable",30,null,null,"< Please Select CCC Type>",0]
["Additional Information 1",null,"Planning Check",null,"Communication",null,"Residential",200,null,null,null,"Not Applicable",0,null,null,"No Code Compliance Certificate",0]
["Additional Information 2",null,"Drainage Report",null,"Processing",null,"Commercial",255,null,null,null,null,null,null,null,"Residential solid or liquid fuel heater",100]
["Additional Information 3",null,"PIM Administration",null,"RFI Processing",null,null,null,null,null,null,null,null,null,null,"Residential minor building work",126]
["Additional Information 4",null,"Specialists",null,"Structural Engineer",null,null,null,null,null,null,"FixedAdminFee","Charge",null,null,"Residential accessory buildings and residential alterations",220]
["Additional Information 5",null,"Other",null,"Geotech Engineer",null,null,null,null,null,null,"Applicable",175,null,null,"Residential new dwelling",360]
["Additional Information 6",null,"Vetting",null,"Fire Engineer",null,null,null,null,null,null,"Not Applicable",0,null,null,"Commercial 1-2, Residential multi-unit or alterations to a commercial 3 less than/equal to $500,000",550]
["Additional Information 7",null,"Admin",null,"Other Specialist Input",null,null,null,null,null,null,null,null,null,null,"Commercial 3 over $500,000",1200]
["Additional Information 8",null,null,null,"Meeting"]
["Additional Information 9",null,null,null,"Other"]
["Additional Information 10",null,null,null,"End Administration",null,null,null,null,null,null,"CT","Charge",null,null,"Type","Charge"]
["Additional Information 11",null,null,null,"Granting",null,null,null,null,null,null,"Applicable",14.4,null,null,"< Please Select Connections >",0]
["Additional Information 12",null,null,null,null,null,null,null,null,null,null,"Not Applicable",0,null,null,"No CCC Connection",0]
["Additional Information 13",null,null,null,null,null,null,null,null,null,null,null,null,null,null,"Standard Water Connection:",995]
["Additional Information 14",null,null,null,null,null,null,null,null,null,null,null,null,null,null,"Stormwater Opening:",125]
["Additional Information 15",null,null,null,null,null,null,null,null,null,null,null,null,null,null,"Sewer Opening:",245]
["Additional Information 16",null,null,null,null,null,null,null,null,null,null,"PIMCOORD","Charge",null,null,"Vehicle Crossing Inspection:",153]
["Additional Information 17",null,null,null,null,null,null,null,null,null,null,"Applicable",30]
["Additional Information 18",null,null,null,null,null,null,null,null,null,null,"Not Applicable",0,null,null,"Type","Charge"]
{"$rows_left_out":14}
{"sheet":"Names of Officers","index":6,"n_rows":514,"n_cols":28,"rows_kept":514,"cut":false,"hidden":true,"merged":[]}
[]
[null,"F1","F2","F3","F4","F5","F6","F7","F8","F9","F10","F11","F12","F13","F14","F15","F16","F17","F18","F19","F20","F21","F22","F23","F24","F25","F26","F27"]
[null,"Name","Role"]
[null,"Please Select",null,null,null,0]
[null,"Aaron Edwards","Planner 2/3","2015-07-01","3999-12-31",37,null,null,null,null,null,null,null,null,null,null,null,null,null,null,null,null,null,null,null,null,"Num Dates",1]
[null,"Aaron Harrison","Opus Intermediate","2015-07-01","2016-02-25",26,null,null,null,null,null,null,null,null,null,null,null,null,null,null,null,null,null,null,null,null,"Num Rows",511]
[null,"Aaron Haymes","Snr Engineer/Team manager","2015-07-01","3999-12-31",6]
[null,"Abdul Musif","Building Administrator","2015-07-01","3999-12-31",59]
[null,"Adam Modica","PBO/Specialist Engineer","2015-07-01","3999-12-31",5]
[null,"Adam Wang","BCO 1","2015-07-01","3999-12-31",1]
[null,"Adelina Pop","BCO 1","2015-07-01","3999-12-31",1]
[null,"Adrian Cosby","Drainage Site Audit 2","2015-07-01","3999-12-31",51]
[null,"Adrienne Slattery","Holmes Fire Experienced","2015-07-01","2017-04-30",19]
[null,"Adrienne Slattery","Snr Engineer/Team manager","2017-05-01","3999-12-31",6]
[null,"Agnes van der Erf","Environmental Health Officer","2015-07-01","3999-12-31",76]
[null,"Aimee Dodge","Vetting & Allocation","2017-07-01","3999-12-31",81]
[null,"Al Wilson","Opus Experienced","2015-07-01","2021-02-16",25]
[null,"Al Wilson","WSP Experienced","2021-02-17","3999-12-31",25]
[null,"Alan Wilson","Opus Experienced","2015-07-01","2018-07-01",25]
[null,"Alie Nieuwenhuize","Building Administrator","2015-07-01","2017-01-25",59]
{"$rows_left_out":495}
{"sheet":"DedupedNames","index":7,"n_rows":412,"n_cols":1,"rows_kept":412,"cut":false,"hidden":true,"merged":[]}
["Please Select"]
["Aaron Edwards"]
["Aaron Harrison"]
["Aaron Haymes"]
["Abdul Musif"]
["Adam Modica"]
["Adam Wang"]
["Adelina Pop"]
["Adrian Cosby"]
["Adrienne Slattery"]
["Agnes van der Erf"]
["Aimee Dodge"]
["Al Wilson"]
["Alan Wilson"]
["Alie Nieuwenhuize"]
["Alison Tang"]
["Alison Thompson"]
["Alistair Sharp"]
["Allen Pranesh"]
["Amarana Furminger"]
{"$rows_left_out":393}
{"sheet":"Role Fee Structure","index":8,"n_rows":90,"n_cols":28,"rows_kept":90,"cut":false,"hidden":true,"merged":[]}
[]
[null,"Role","Role Value2","Effective Start Date","Effective End Date","2016","2017","2018","2019","2020","2021","2022","F13","F14","F15","F16","F17","F18","F19","F20","F21","F22","F23","F24","F25","F26","F27","F28"]
[null,"Please Select",null,null,null,0,0,0,0,0,0]
[null,"BCO 1",1,"2015-07-01","3999-12-31",173,173,210,210,210,210,null,null,null,null,null,null,null,null,null,null,null,null,null,null,null,"Num Dates",7]
[null,"BCO 2",2,"2015-07-01","3999-12-31",200,200,210,210,210,210,null,null,null,null,null,null,null,null,null,null,null,null,null,null,null,"Num Rows",87]
[null,"BCO 3",3,"2015-07-01","3999-12-31",220,220,210,210,210,210]
[null,"Snr BCO/Specialists",4,"2015-07-01","3999-12-31",236,236,243,245,245,245]
[null,"PBO/Specialist Engineer",5,"2015-07-01","3999-12-31",273,273,275,275,275,275]
[null,"Snr Engineer/Team Manager",6,"2015-07-01","3999-12-31",294,294,294,294,294,294]
[null,"Ext Spec/Consult Expert",7,"2015-07-01","3999-12-31",0,0,0,0,0,0]
[null,"Aurecon Expert",8,"2015-07-01","3999-12-31",330,330,330,330,330,330]
[null,"Aurecon Experienced",9,"2015-07-01","3999-12-31",265,265,265,265,265,265]
[null,"BTW Structural",10,"2015-07-01","3999-12-31",225,225,225,225,225,225]
[null,"DSC Group",73,"2016-09-01","2017-01-25",157.55000000000001,157.55000000000001,157.55000000000001,157.55000000000001,157.55000000000001,157.55000000000001]
[null,"DSC Group",73,"2017-01-26","3999-12-31",200,200,210,210,210,210]
[null,"Fire Matters",11,"2015-07-01","3999-12-31",235,235,235,235,235,235]
[null,"GHD Expert",12,"2015-07-01","3999-12-31",260,260,260,294,294,294]
[null,"GHD Experienced",13,"2015-07-01","3999-12-31",220,220,220,294,294,294]
[null,"GHD Intermediate",14,"2015-07-01","3999-12-31",185,185,185,275,275,275]
[null,"Golder Associate Expert",15,"2015-07-01","3999-12-31",375,375,375,294,294,294]
{"$rows_left_out":70}