{"text_format":"1","workbook":"xlsx","n_sheets":15,"sheets":["Summary sheet","Vetting sheet","App Update","B521-RFI letter","B120-Processing sheet","B150-Structural specialist ","B462-Draft CS","B151a-Fire safety specialist","B151b-Fire safety specialist","B160-PS specialist","S71-74 natural hazards","B501-Not accepted letter","B501a-Not accepted with invoice","B529-Final reminder letter","B532-Refusal letter"],"not_rendered":{"charts":0,"images":11,"macros":1,"external_links":0,"defined_names":110,"comments":7,"pivot_tables":0},"unopened":[],"bounds":{"document_bytes":16777216,"sheet_cells":100000,"rows_first":2000,"rows_last":500,"rows_between":2000,"halvings":0,"cell_chars":16384,"cell_head_chars":4096},"cells_cut":0,"cells_raw":0,"read":"whole","date_system":"1900"}

{"sheet":"Summary sheet","index":0,"n_rows":97,"n_cols":11,"rows_kept":97,"cut":false,"hidden":false,"merged":[[7,6,7,7],[45,6,45,7],[30,1,30,2],[67,1,67,2],[96,1,96,3],[95,1,95,3],[88,1,88,2],[89,1,89,2],[90,1,90,2],[93,1,93,4],[94,1,94,4],[92,1,92,4],[86,1,86,2],[87,1,87,2],[78,1,78,2],[79,1,79,2],[80,1,80,2],[81,1,81,2],[82,1,82,2],[83,1,83,2],[84,1,84,2],[85,1,85,2],[60,1,60,2],[61,1,61,2],[76,1,76,2],[77,1,77,2],[73,1,73,2],[74,1,74,2],[68,1,68,2],[69,1,69,2],[70,1,70,2],[71,1,71,2],[72,1,72,2],[63,1,63,2],[64,1,64,2],[65,1,65,2],[66,1,66,2],[54,1,54,3],[56,1,56,2],[57,1,57,2],[58,1,58,2],[59,1,59,2],[29,1,29,2],[31,1,31,2],[32,1,32,2],[35,1,35,2],[12,1,12,3],[13,1,13,3],[14,1,14,3],[15,1,15,3],[16,1,16,3],[22,1,22,3],[23,1,23,3],[24,1,24,3],[25,1,25,3],[27,1,27,2],[33,1,33,2],[34,1,34,2],[50,1,50,3],[51,1,51,3],[52,1,52,3],[53,1,53,3],[2,1,2,4],[6,1,6,3],[7,1,7,3],[8,1,8,3],[9,1,9,3],[10,1,10,3],[11,1,11,3],[20,1,20,4],[17,1,17,3],[18,1,18,3],[21,1,21,3],[28,1,28,2]]}
[null,null,null,null,null,null,"Summary sheet","B501-Not accepted letter"]
[null,"B-100C LU: 20.12.16 LR: 20.12.16 v7",null,null,null,null,"Vetting sheet","B501a-Not accepted with invoice"]
[null,"COMMERCIAL PROCESSING SHEET",null,null,null,null,"B120-Processing sheet","Application update letter"]
[null,"SUMMARY SHEET",null,null,null,null,"B150-Structural specialist","B521-RFI letter"]
[null,null,null,null,null,null,"B151a-Fire safety specialist","B529-Final reminder letter"]
[null,"PROJECT DETAILS",null,null,null,null,"B151b-Fire safety specialist","B532-Refusal letter",null,null,"C/-"]
[null,"Name of first point of contact",null,null,"Trevor Jones ",null,"B160-PS specialist","S71-74 natural hazards","Residential 1"]
[null,"Contact's email address",null,null,"trevor@architecturaldesigngroup.co.nz",null,"B462-Draft CS",null,"Residential 2"]
[null,"Contact's postal address (street)",null,null,"47 Second Avenue , Tauranga",null,null,null,"Residential 3"]
[null,"Contact's postal address (city) and (postcode)",null,null,"Tauranga",null,null,null,"Commercial 1"]
[null,"Contact's salutation for letters ",null,null,"Sir / Madam",null,null,null,"Commercial 2"]
[null,"Owner's name",null,null,"John Targett",null,null,null,"Commercial 3"]
[null,"Owner's email address",null,null,"jt@clipnclimb.com"]
[]
[null,"Building consent number (BCN):   ",null,null,"BCN/2017/2013",null,null,null,"Building Consent:"]
[null,"Project address:   ",null,null,"80 Byron Street Sydenham "]
[null,"Description of building work:","Project description:","Project description:","Addition to Factory - New Offices, Meeting and Store Room"]
[null,"Building level:        ",null,null,"Commercial 1"]
[null,"Classified use(s):  ",null,null,"Commercial"]
[]
[null,"TECHNICAL ACCEPTANCE CHECK DETAILS"]
[null,"Vetting officer's name:",null,null,"Barjinder jit Singh"]
[null,"Vetting officer's title:",null,null,"Vetting Officer"]
[null,"Vetting officer's competency level:",null,null,"Barjinder jit Singh COM 3 Vetting"]
[null,"Date technical acceptance check completed:       ",null,null,{"$f":"IF('Vetting sheet'!C103=\"\",\"\",'Vetting sheet'!C103)","v":"2017-02-15"}]
[null,"Vetting officer's notes for Admin\nBookmarking, CT etc.",null,null,"TCN/A Property falls in the FMA Area "]
[]
[null,"TECHNICAL ACCEPTANCE CHECK PROCEDURE QUESTIONS",null,"(Yes/N/a)","COMMENTS"]
[null,"Has the building consent application been inputted into Connect correctly?\nCorrect description of building work, value of work and building category. ",null,"Yes",null,null,null,null,"Yes",{"$f":"$B$29","v":"Has the building consent application been inputted into Connect correctly?\nCorrect description of building work, value of work and building category. "}]
[null,"If the application involves re-cladding work to an existing building has the applicant completed the ‘Re-cladding/WHRS related work’ questions in the appendix of the application form?\n• If the applicant has answered yes to ‘Does the work involve re-cladding the building?’ insert ‘This application involves recladding’ memo in Connect.\n• If the applicant has answered yes to ‘Is this application related to a claim under the Weathertight Homes Resolution Service scheme?’ add to the description of building work ‘related to a claim under the WHRS Act 2006’",null,"N/A",null,null,null,null,"N/A",{"$f":"B30","v":"If the application involves re-cladding work to an existing building has the applicant completed the ‘Re-cladding/WHRS related work’ questions in the appendix of the application form?\n• If the applicant has answered yes to ‘Does the work involve re-cladding the building?’ insert ‘This application involves recladding’ memo in Connect.\n• If the applicant has answered yes to ‘Is this application related to a claim under the Weathertight Homes Resolution Service scheme?’ add to the description of building work ‘related to a claim under the WHRS Act 2006’"}]
[null,"Does the consent have a Housing NZ connection? If so, create a Connect 'urgent memo' stating \"Housing NZ related consent\".\nCheck Description of Building Work and/or Owner/Agent details on application form.",null,"N/A",null,null,null,null,null,"Does the consent have a Housing NZ connection? If so, create a Connect 'urgent memo' stating \"Housing NZ related consent\".\nCheck Description of Building Work and/or Owner/Agent details on application form."]
[null,"Accepted / Not accepted letter sent?\nDate sent",null,"Yes","2017-2-15 - Not Accepted - The agent was contacted regarding the missing information and was explained the whole V & A procedure of Not Acceptance with an invoice , An Email regading missing information was also sent and saved under 17/151331 - This Application has been not accepted by me under BCN/2017/870 - The Application has now been accepted as all the required information has been provided now - SEE HP TRIM LINK 17/157760 for a non - acceptance letter.",null,null,null,null,{"$f":"B32","v":"Accepted / Not accepted letter sent?\nDate sent"}]
[null,"PIM/DR workflows activated in Connect?\nWhere these PIM/DR workflows are not needed or can be completed by BCO start workflow immediately",null,"Yes","BC Only - Development Report - Description of work has been changed from Office/Administration addition to existing building to Alterations and Additions to Existing Commercial Building - New Office/Meeting and Store Room on 2017-2-15 by Banny Singh",null,null,null,null,{"$f":"B33","v":"PIM/DR workflows activated in Connect?\nWhere these PIM/DR workflows are not needed or can be completed by BCO start workflow immediately"}]
[null,"Has the earthquake structural strengthening work questions been answered in the Appendix section A on Form 2?\nIf Yes, populate questions in EQUAKE section in Connect.",null,"N/A",null,null,null,null,null,"Has the earthquake structural strengthening work questions been answered in the Appendix section A on Form 2?\nIf Yes, populate questions in EQUAKE section in Connect."]
[null,"Has it been marked on Form 2 that a vehicle crossing is required?\n• If yes, mark under 'Other Fee Options' below that a vehicle crossing inspection is required.\n• If a vehicle crossing application form has been supplied, forward on to RoadAmenityAdmin@ccc.govt.nz.",null,"N/A",null,null,null,null,null,"Has it been marked on Form 2 that a vehicle crossing is required?\n• If yes, mark under 'Other Fee Options' below that a vehicle crossing inspection is required.\n• If a vehicle crossing application form has been supplied, forward on to RoadAmenityAdmin@ccc.govt.nz."]
[null,"Does a copy of the application for building consent have to be forwarded to NZ Fire Service Engineering Unit? \nSee New Zealand Fire Service Statutory Notification procedure, fire safety design report and s46, BA 2004.",null,"N/A",null,null,null,null,null,{"$f":"B36","v":"Does a copy of the application for building consent have to be forwarded to NZ Fire Service Engineering Unit? \nSee New Zealand Fire Service Statutory Notification procedure, fire safety design report and s46, BA 2004."}]
[]
[null,"Reviews using processing sheet","Is review required\n(Yes/N/a)","Status or\nDate Review Completed"," Reviewer's Name"]
[null,"BCO review (B-120)","Yes",{"$f":"IF(C39=\"N/A\",\"\",IF('B120-Processing sheet'!G244=\"\",\"\",'B120-Processing sheet'!G244))","v":"2017-08-15"},{"$f":"IF(C39=\"N/A\",\"\",IF(E51=\"\",\"\",E51))","v":"Tania McGrath"},null,"Summary sheet","B501-Not accepted letter"]
[null,"Geotechnical (B1)","Yes",{"$f":"IF(C40=\"N/A\",\"\",IF('B150-Structural specialist '!G40=\"\",\"\",'B150-Structural specialist '!G40))","v":"2017-08-15"},{"$f":"IF(C40=\"N/A\",\"\",IF('B150-Structural specialist '!F40=\"\",\"\",'B150-Structural specialist '!F40))","v":"Margaret Stoffel"},null,"Vetting sheet","B501a-Not accepted with invoice"]
[null,"Structure (B1 and B2 producer statements)","N/A",{"$f":"IF(C41=\"N/A\",\"\",IF('B150-Structural specialist '!G39=\"\",\"\",'B150-Structural specialist '!G39))","v":""},{"$f":"IF(C41=\"N/A\",\"\",IF('B150-Structural specialist '!F39=\"\",\"\",'B150-Structural specialist '!F39))","v":""},null,"B120-Processing sheet","Application update letter"]
[null,"Fire (C1-6)","Yes",{"$f":"IF(C42=\"N/A\",\"\",IF('B151a-Fire safety specialist'!G73=\"\",\"\",'B151a-Fire safety specialist'!G73))","v":"2017-08-01"},{"$f":"IF(C42=\"N/A\",\"\",IF('B151a-Fire safety specialist'!F73=\"\",\"\",'B151a-Fire safety specialist'!F73))","v":"Adrienne Slattery (Jonathan Nyman from 13/7/2017)"},null,"B150-Structural specialist","B521-RFI letter"]
[null,"Fire (during and post fire)","N/A",{"$f":"IF(C43=\"N/A\",\"\",IF('B151b-Fire safety specialist'!G41=\"\",\"\",'B151b-Fire safety specialist'!G41))","v":""},{"$f":"IF(C43=\"N/A\",\"\",IF('B151b-Fire safety specialist'!F41=\"\",\"\",'B151b-Fire safety specialist'!F41))","v":""},null,"B151a-Fire safety specialist","B529-Final reminder letter"]
[null,"Structure (during and post fire)","N/A",{"$f":"IF(C44=\"N/A\",\"\",IF('B151b-Fire safety specialist'!G42=\"\",\"\",'B151b-Fire safety specialist'!G42))","v":""},{"$f":"IF(C44=\"N/A\",\"\",IF('B151b-Fire safety specialist'!F42=\"\",\"\",'B151b-Fire safety specialist'!F42))","v":""},null,"B151b-Fire safety specialist","B532-Refusal letter"]
[null,"Producers statements (G4, D2, G9)","Yes",{"$f":"IF(C45=\"N/A\",\"\",IF('B160-PS specialist'!G31=\"\",\"\",'B160-PS specialist'!G31))","v":"2017-08-15"},{"$f":"IF(C45=\"N/A\",\"\",IF('B160-PS specialist'!F31=\"\",\"\",'B160-PS specialist'!F31))","v":"Nick Waddington "},null,"B160-PS specialist","S71-74 natural hazards"]
[null,"S71-74 natural hazards","N/A",{"$f":"IF(C46=\"N/A\",\"\",IF('S71-74 natural hazards'!$G$30=\"\",\"\",'S71-74 natural hazards'!$G$30))","v":""},{"$f":"IF(C46=\"N/A\",\"\",IF('S71-74 natural hazards'!F30=\"\",\"\",'S71-74 natural hazards'!$F$30))","v":""},null,"B462-Draft CS"]
[null,"Civil (E1) (on B-120)","Yes","2017-07-13","Donnick Mugutso"]
[null,"Plumbing and drainage (G12, G13) (on B-120)","N/A"]
[]
[null,"PROCESSING DETAILS",null,null,null,null,null,null,"Vetting Officer"]
[null,"Processing officer's name:",null,null,"Tania McGrath",null,null,null,"Building Consent Officer"]
[null,"Processing officer's title:",null,null,"Building Consent Officer",null,null,null,"Senior Building Consent Officer"]
[null,"Processing officer's competency level:",null,null,"Com 1 indirect"]
[null,"Date processing started: ",null,null,"2017-04-06"]
[null,"Record any warnings, comments and internal instructions:",null,null,"07/06/17 - contacted by structural engineer who advised project still to go ahead and response will be sent soon."]
[]
[null,"PROCESSING PROCEDURE QUESTIONS",null,"(Yes/N/a)","COMMENTS"]
[null,"PIM/DR BCO processing workflow completed in Connect?\n\n\n",null,"Yes",null,null,null,null,null,{"$f":"B58","v":"PIM/DR BCO processing workflow completed in Connect?\n\n\n"}]
[null,"RFI letter sent?\n\nRecord dates of when RFI letters are sent. Use B-521 tab to send RFI letter to applicant.",null,"Yes","RFI sent 11/04/17, response received 11/07/17\nRFI 2 sent 14/07/17, response received 27/07/17 - noted that they have not responded to at least one question - agent contacted via phone 31/07/17, based on this the consent has been placed back on-hold from this date.\nRFI 3 sent 02/08/17, partial response for structure only 03/08/17\nremainder of response received 15/08/17",null,null,null,null,{"$f":"B59","v":"RFI letter sent?\n\nRecord dates of when RFI letters are sent. Use B-521 tab to send RFI letter to applicant."}]
[null,"Is supervision required by a competent officer?\n\nRecord details of supervision by competent officer for processing builidng consent for building work level above processing officer’s competency level. \nRecord decision if n/a because supervision is not needed because alteration to buildings is considered to be lower competency level than the building level",null,"Yes","SBCO Katharine Riley - RFI 1 - 10/04/17\nSBCO Katharine Riley - RFI 2 - 13/07/17\nSBCO Katharine Riley - RFI 3 - 02/08/17 - via phone/remote\nSBCO Katharine Riley - Granting - 15/08/17\nStructural Rolando Basobas - RFI 1 - 11/04/17\nStructural Rolando Basobas - RFI 2 - 14/07/17, discussed as item not addressed review delayed until response received\nSructural - RFI 3, structure only - 04/08/17 - review complete",null,null,null,null,{"$f":"B60","v":"Is supervision required by a competent officer?\n\nRecord details of supervision by competent officer for processing builidng consent for building work level above processing officer’s competency level. \nRecord decision if n/a because supervision is not needed because alteration to buildings is considered to be lower competency level than the building level"}]
[null,"Ground conditions report included in application?\n\nWhere applicable BCO is to provide details of which pages contain the ground conditions report for Admin to extract from file and save in HPRM as BCN# Ground Report and send link to engineeringservicesGIS@ccc.govt.nz",null,"Yes","Supp docs pg 95-144",null,null,null,null,{"$f":"B61","v":"Ground conditions report included in application?\n\nWhere applicable BCO is to provide details of which pages contain the ground conditions report for Admin to extract from file and save in HPRM as BCN# Ground Report and send link to engineeringservicesGIS@ccc.govt.nz"}]
[null,"Detailed engineering evaluation (DEE) included in application? \n\nWhere applicable the BCO is to provide details of the pages containing the DEE report for Admin to extract from file and save in HPRM as BCN# DEE report – address and send link to DEEs@ccc.govt.nz\n\nHas the earthquake structural strengthening work questions under the EQUAKE section in Connect been answered correctly?",null,"Yes","supp docs pg 165-230",null,null,null,null,{"$f":"B62","v":"Detailed engineering evaluation (DEE) included in application? \n\nWhere applicable the BCO is to provide details of the pages containing the DEE report for Admin to extract from file and save in HPRM as BCN# DEE report – address and send link to DEEs@ccc.govt.nz\n\nHas the earthquake structural strengthening work questions under the EQUAKE section in Connect been answered correctly?"}]
[]
[null,"FINAL PROCEDURES CHECKLIST",null,"(Yes/N/a)","COMMENTS"]
[null,"All required reviews completed, RFI responses checked and saved to the HPRM building consent application folder, and consent documents updated and stamped?",null,"Yes"]
[null,"Where a project information memorandum has been requested has this been completed and issued or will be attached?",null,"N/A"]
[null,"Where a development contribution is payable has a Section 36 notice been attached to the PIM or building consent?",null,"Yes"]
[null,"Where resource consent approval is still needed has a Section 37 certificate been attached to the PIM or building consent?  ",null,"N/A"]
[null,"Have the construction documentation & advice notes been added to the B-411?\nBCO to ensure construction documentation & advice notes have been correctly added to B-411.",null,"Yes"]
[null,"Has an estimate been made of the inspections required to the B-412 or B-413?",null,"Yes"]
[null,"Where there will be new, altered or removed specified systems has a draft compliance schedule been created on the B-462 for this building consent and the HPRM link sent to BuildingWOF@ccc.govt.nz?",null,"Yes"]
[null,"Has all processing time been recorded in SAP and other fees been recorded on fee option table below?",null,"Yes"]
[null,"Have conditions been added for building consent (form 5) where Building Act sections 67, 73, 77 or 113 apply?",null,"N/A"]
[null,"Has all relevant information been placed in the HPRM building consent application folder?",null,"Yes"]
[null,"Have all workflows been completed in Connect and final admin workflow activated?",null,"Yes"]
[]
[null,"OTHER FEE OPTIONS only select options required",null,"(Yes / #)"]
[null,"Commercial / Residential PFVS Building (FILECO/RE)",null,"N/A"]
[null,"NZ Fire Service (FIRREC/R)",null,"Yes"]
[null,"Memo of Encumbrance (MEMOEC/R)",null,"N/A"]
[null,"Section 73, (Hazards) (SECT73C/R)",null,"N/A"]
[null,"Section 75, Building Act 2004 (Multi-titles) (SECT75C/R)",null,"N/A"]
[null,"Sewer Lateral Fee (SEWLAT)",null,"N/A"]
[null,"Sewer Opening (SEWOPE)",null,"N/A"]
[null,"Stormwater Opening (STOOPE)",null,"N/A"]
[null,"Vehicle Crossing Inspection (VEHICL)",null,"N/A"]
[null,"Standard Water Connection (WATRCS)",null,"N/A"]
[null,"Printing (PRINTC/R)",null,"N/A"]
[null,"Scanning (SCANNC/R)",null,"N/A"]
[null,"Certificate of title (fee by admin for Land on line)",null,"N/A"]
[null,"Compliance schedule",null,"Yes"]
[]
[null,"GRANTED OR REFUSED DECISION Select option and sign below"]
[null,"           On the basis  of having completed all relevant technical checks, I am satisfied on reasonable grounds that the provisions of the building code have been met in accordance with section 49 of the Building Act 2004. The building consent is hereby granted for and on behalf of the Christchurch City Council",null,null,null,null,null,null,true,null,{"$f":"B94","v":"           On the basis  of having completed all relevant technical checks, I am satisfied on reasonable grounds that the provisions of the building code have been met in accordance with section 49 of the Building Act 2004. The building consent is hereby granted for and on behalf of the Christchurch City Council"}]
[null,"             On the basis of having completed all relevant technical checks, I am not satisfied on reasonable grounds that the provisions of the building code have been met in accordance with section 49 of the Building Act 2004. The building consent is  hereby refused under section 50 of the Building Act 2004 for and on behalf of the Christchurch City Council",null,null,null,null,null,null,false,null,{"$f":"B95","v":"             On the basis of having completed all relevant technical checks, I am not satisfied on reasonable grounds that the provisions of the building code have been met in accordance with section 49 of the Building Act 2004. The building consent is  hereby refused under section 50 of the Building Act 2004 for and on behalf of the Christchurch City Council"}]
[null,"Signature:"]
[null,"If application refused, Team Manager approval has been sought. \nTeam Manager name; date consulted; reason for the refusal.",null,null,null,null,null,null,null,{"$f":"$B$97","v":"If application refused, Team Manager approval has been sought. \nTeam Manager name; date consulted; reason for the refusal."}]

{"sheet":"Vetting sheet","index":1,"n_rows":103,"n_cols":29,"rows_kept":103,"cut":false,"hidden":false,"merged":[[7,6,7,7],[5,1,5,4],[101,2,101,4],[102,2,102,4],[7,2,7,4],[98,2,98,4],[99,1,99,4],[100,1,100,4],[97,1,97,4],[11,2,11,4],[6,2,6,4],[8,2,8,4],[9,2,9,4],[10,2,10,4],[12,1,12,4]]}
[null,null,null,null,null,null,"Summary sheet","B501-Not accepted letter"]
[null,null,null,null,null,null,"Vetting sheet","B501a-Not accepted with invoice"]
[null,null,null,null,null,null,"B120-Processing sheet","Application update letter"]
[null,"B-100C LU: 20.12.16 LR: 20.12.16 v7",null,null,null,null,"B150-Structural specialist","B521-RFI letter"]
[null,null,null,null,null,null,"B151a-Fire safety specialist","B529-Final reminder letter"]
[null,"VETTING SHEET",null,null,null,null,"B151b-Fire safety specialist","B532-Refusal letter"]
[null,"Building consent number (BCN):   ",{"$f":"'Summary sheet'!$E$15","v":"BCN/2017/2013"},null,null,null,"B160-PS specialist","S71-74 natural hazards"]
[null,"Project address:   ",{"$f":"'Summary sheet'!E16","v":"80 Byron Street Sydenham "},null,null,null,"B462-Draft CS",null,"Y"]
[null,"Description of building work:",{"$f":"'Summary sheet'!E17","v":"Addition to Factory - New Offices, Meeting and Store Room"},null,null,null,null,null,"N/a"]
[null,"Building level:        ",{"$f":"'Summary sheet'!E18","v":"Commercial 1"},null,null,null,null,null,"Mis"]
[null,"Classified use(s):  ",{"$f":"'Summary sheet'!E19","v":"Commercial"}]
[null,null,"Key for abbreviations to answering pre-acceptance technical check questions\nY - The application satisfies the intent of question. Provide comment if appropriate\nN/a - The question is not applicable to this application. Provide comment if appropriate\nMis - The application is missing information. Provide details in the missing information items cell to be include in the Not accepted letter."]
[null,"PRE-ACCEPTANCE TECHNICAL CHECK"]
[null,"Questions to be answered","Y\n N/a\nMis","Comments","Missing information items"]
[null,"1. GENERAL:",null,null,null,null,null,null,null,"Not all manadatory sections of the application form was completed."]
[null,"a. Building Consent Application: All required sections of application form completed and signed?","Y",null,null,null,null,null,null," Section 4 of the application form was not signed."]
[null,"b. Acceptable Proof of Ownership supplied?","Y","Page 12 on the Application for CT - CT is dated 4-1-2017",null,null,null,null,null,"No proof of ownership in the form of a recent certificate of title, and if necessary a sale and purchase agreement, or the relevant portions of a current lease agreement."]
[null,"c. If the proposed building work includes 'restricted building work' has an appropriate 'certificate of design work' been provided for all of the proposed 'restricted building work' by each LBP, Architect or Engineer?","N/a",null,null,null,null,null,null,"This proposal includes restricted building work. No certificate of design work has been provided from each licensed building practitioner involved in the design work that is restricted building work."]
[null,"2. SITE / LOCATION:"]
[null,"a. Site Plan provided detailing the necessary information?  ","Y","Page 2 on the plans ",null,null,null,null,null,"The site plan does not include all of the necessary information This includes [drainage, vehicle crossings, levels, …]."]
[null,"b. Levels provided? ","Y","Page 2 on the plans ",null,null,null,null,null,"Sufficient levels have not been provided for the proposed work. These include […]."]
[null,"3. DEMOLITION / REMOVAL:"]
[null,"a. Site plan provided which clearly shows the extent of demolition work and identifies termination locations of services?  ","N/a",null,null,null,null,null,null,"The extent of the demolition work and the locations of termination points of the services has not been clearly shown."]
[null,"4. SITE MANAGEMENT AND PROTECTION OF PUBLIC:"]
[null,"a. Details of Gantries and Hoardings for the protection of public provided?","Y","Page 2 on the plans ",null,null,null,null,null,"No details of gantries and hoardings for the protection of public."]
[null,"b. Is a site specific sediment control management plan provided?","Y","Page 2 on the plans ",null,null,null,null,null,"No details of a site-specific sediment control management plan."]
[null,"5. SERVICES:"]
[null,"a. Plumbing details provided? ","Y","Page 4 on the plans ",null,null,null,null,null,"No plumbing details including pipe sizes and falls."]
[null,"b. Drainage Plan provided? ","Y","Page 4 on the plans ",null,null,null,null,null,"No drainage plan including drain sizes and falls."]
[null,"c. Details of Water Supply provided?","Y","Page 4 on the plans ",null,null,null,null,null,"No water supply details."]
[null,"d. Details of Gas Supply / Appliances provided?  ","Y",null,null,null,null,null,null,"No details of the [gas supply, gas appliances]."]
[null,"e. Details of Solid / Liquid / Gas Heating provided? ","N/a",null,null,null,null,null,null,"No details of the [solid, liquid, gas] heating."]
[null,"f. Details of Electrical / Mechanical services provided? ","Y","Page 10 on the plans ",null,null,null,null,null,"No details of [electrical, mechanical] services."]
[null,"g. HVAC drawings and Producer Statement PS1 provided? ","Y","The Agent is relying on G4/AS1",null,null,null,null,null,"No HVAC drawings and calculations. A producer statement - design (PS1) may also assist in the approval of your application."]
[null,"h. Other authorisations provided?  ","N/a",null,null,null,null,null,null,"No details of the […]."]
[null,"6. FOUNDATIONS / FLOOR:"]
[null,"a. Report / Producer Statement (PS1) verifying ground conditions provided? ","Y","Page 56 to 83 on the Supporting Documents - Geotechnical Report has been prepared by EDC - Signed and Dated by Blair Griffiths and reviewed by Giles Learman - Report is signed and Dated on 14-3-2017 - Report includes information regarding Scala Pentrometer Tests",null,null,null,null,null,"No report verifying the ground conditions on the site. A producer statement - design (PS1) may also assist in the approval of your application."]
[null,"b. Foundation Plan(s) and Details provided?","Y","Page 9 on the plans ",null,null,null,null,null,"No foundation plan(s) and details."]
[null,"7. CONSTRUCTION:  "]
[null,"a. Existing Floor Plan provided? (for additions and alterations only)","N/a",null,null,null,null,null,null,"No existing floor plan."]
[null,"b. Proposed Floor Plans provided?","Y","Page 6 on the plans ",null,null,null,null,null,"No proposed floor plan."]
[null,"c. Proposed Floor Framing Plan provided? (for suspended and upper floors only) ","N/a",null,null,null,null,null,null,"No proposed floor framing plan."]
[null,"d. Bracing Plans provided?","Y","Page 7 on the plans ",null,null,null,null,null,"No bracing plans."]
[null,"e. Bracing Details (e.g. Calculations or PS1) provided? ","Y","Page 8 on the plans ",null,null,null,null,null,"No bracing details and calculations. A producer statement, PS1 design may also assist in the approval of your application."]
[null,"f. Have a sufficient number of Sections been provided to show how the building is to be constructed?  ","Y","Page 11 & 12 on the plans ",null,null,null,null,null,"There is insufficient number of sections to show how the building is to be constructed."]
[null,"g. Are all necessary (general) Construction Details provided? ","Y","Page 13 to 20 on the plans ",null,null,null,null,null,"There are insufficient details to show how the building is to be constructed. In particular […]."]
[null,"h. Truss Design and associated details provided? ","N/a",null,null,null,null,null,null,"No truss design, details and supporting statements from the designer or manufacturer."]
[null,"i. Energy Efficiency (Insulation) method of compliance specified and support calculations provided?","Y","Page 1 on the supporting documents for H1 Compliance ",null,null,null,null,null,"No details of the specify method of compliance for H1 energy efficiency (insulation) or supporting calculations."]
[null,"j. Has sufficient supporting information been provided for alternative solutions?","N/a"]
[null,"8. STRUCTURAL:"]
[null,"a. Structural Report – If the proposed building work involves remediation of earthquake damage to a commercial building a DEE report will be required  ","N/a",null,null,null,null,null,null,"As the proposed building work includes remediation of earthquake damage to a commercial building a detailed engineering evaluation (DEE) is required."]
[null,"b. Structural Drawings – plans details and specifications provided? ","Y","All Drawings are incorporated with architectural drawings ",null,null,null,null,null,"No structural plans, details and specifications required to show compliance with B1 structure."]
[null,"c. Producer Statements (PS1) to support specific design provided? ","Y","Page 31 on the supporting documents - William Julius Long - 231242 - License is checked and is registered - Areas of work being covered by PS1 - Structure Engineering ",null,null,null,null,null,"A producer statement, PS1 design, from the structural engineer may also assist in the approval of your application."]
[null,"d. Structural Calculations (required with all Producer Statements) provided? ","Y","Page 33 o 46 on the Supporting documents ",null,null,null,null,null,"No structural calculations to show compliance with B1 structure."]
[null,"9. EXTERNAL:"]
[null,"a. Elevations provided showing necessary details? ","Y","Page 8 on the plans ",null,null,null,null,null,"No elevations showing all necessary details."]
[null,"b. Roof plan provided showing necessary details? ","Y","Page 19 on the plans ",null,null,null,null,null,"No roof plan showing bracing necessary and details."]
[null,"c. Risk Assessment (e.g. Risk Matrix) provided?","N/a",null,null,null,null,null,null,"No weather-tightness risk assessment (e.g. risk matrix)."]
[null,"10. SPECIFICATIONS:"]
[null,"a. Does the specification appear to be specific to the project covering all aspects of the proposed work provided?","Y","Correct address and index shown ",null,null,null,null,null,"No specification specific to the project covering all aspects of the proposed building work."]
[null,"11. SPECIFIED SYSTEMS / COMPLIANCE SCHEDULE (NEW AND EXISTING BUILDINGS)"]
[null,"a. Specified Systems: For each specified system to be installed, altered, or removed in the course of the building work the proposed has the applicant detailed the inspection, routine maintenance and reporting procedures for each system in Section 9 of the application form? (The B-068 form is a template for the appicant to provide this information)","Y","Page 5 on the Application form",null,null,null,null,null,"No details for each specified system to be installed, altered, or removed in the course of the proposed building, details of the inspection, routine maintenance and reporting procedures for each system are to be provided in Section 12 of the application form."]
[null,"12. ACCESSIBILITY – NEW BUILDINGS:"]
[null,"a. Have access routes (including ramps), accessible car parks, accessible toilet compartment etc been shown on drawings?  Check drawing generally for access and facilities for the disabled. ","N/a",null,null,null,null,null,null,"Insufficient details of access routes (including ramps), accessible car parks, accessible toilet compartment, signage etc."]
[null,"13. FIRE:  "]
[null,"a. Fire Report provided? (Includes residential buildings to be unit titled.)","N/a",null,null,null,null,null,null,"No fire report that describes compliance with the fire safety provisions of the Building Code. The fire safety and egress requirements must be accurately reflected in the plans and specifications."]
[null,"b. Is a VM2 solution provided, and has the FEB been signed off for it to be accepted?","N/a"]
[null,"c. Check Fire Report to gauge whether or not the application needs to be referred to the NZ Fire Service Engineering Unit.  ","N/a"]
[null,"14. EXISTING BUILDING:"]
[null,"a. Means of Escape from Fire assessment provided? (Note: Refer also to Item 13 – Fire.)  ","Y","Page 4 to 30 on the Supporting Documents ",null,null,null,null,null,"No fire report that describes compliance with the fire egress provisions of the Building Code. The fire egress requirements must be accurately reflected in the plans and specifications."]
[null,"b. Accessibility: (For buildings/uses listed in Schedule 2 of the Building Act 2004):  Assessment report of access and facilities for people with disabilities provided? (Form B-065 report or similar required) ","Y","Page 47 to 55 on the supporting documents - Report has been signed by Adrian Ellis on 2017-2-16",null,null,null,null,null,"No report of access and facilities for people with disabilities. The Council form B-065 or similar may be used for this purpose."]
[null,"c. Application for Discretion re Upgrades (pursuant to section 112(2) of the Building Act 2004) provided? \nOnly required if the applicant does not intend to comply with section 112(1) in item (b) above.","N/a",null,null,null,null,null,null,"No application for Discretion re Upgrades (pursuant to section 112(2) of the Building Act 2004)."]
[null,"15. SOUND INSULATION:   "]
[null,"a. Airborne and Impact Sound details (usually a consultant report) provided? ","N/a",null,null,null,null,null,null,"No details of compliance with Building Code clause G6 - Airborne and Impact Sound. This is usually in the form of a report from a specialist consultant."]
[null,"16. CHANGE OF USE:    "]
[null,"a. Fire Assessment provided?","N/a",null,null,null,null,null,null,"No fire report that describes compliance with the fire safety provisions of the Building Code. The fire safety and egress requirements must be accurately reflected in the plans and specifications."]
[null,"b. Structural Assessment or engineering assessment provided?","N/a",null,null,null,null,null,null,"No structural engineering assessment of compliance with the structural provisions of the Building Code. Any proposed upgrade work must be accurately reflected in the plans and specifications."]
[null,"c. Sanitary Facilities assessment provided? ","N/a",null,null,null,null,null,null,"No assessment of the compliance with the sanitary facility provisions of the Building Code."]
[null,"d. Additional Household Units assessment of all Building Code clauses provided?","N/a",null,null,null,null,null,null,"As the proposed work includes additional household units,  there is no assessment of compliance with all Building Code clauses.."]
[null,"e. Reasonably Practicable: Where upgrading to fully comply with the Building Code is not proposed, supporting documentation provided?","N/a",null,null,null,null,null,null,"If you consider that it is not reasonably practicable to upgrade the building to fully comply with the Building Code as required by section 115 of the Building Act, comprehensive documentation is required to support this position."]
[null,"17. HAZARDOUS SUBSTANCES AND PROCESSES:"]
[null,"a. Details included to assess HSNO and Building Code requirements provided?","N/a",null,null,null,null,null,null,"No details of hazardous substances and processes associated with the building."]
[null,"18. HAZARDOUS AGENTS OR CONTAMINANTS ON SITE:"]
[null,"a. Check whether or not activity described on the Hazardous Substances and Industries List (HAIL) currently being or has been undertaken (or has more likely than not been undertaken) on the piece of land to which this application relates.  If so, a Detailed Site Investigation report may be required from a suitably qualified and experienced contaminated land specialist in accordance with the NES and its referenced MfE Guidelines (check with the Senior Environment Health Officer).","N/a"]
[null,"19. FOOD PREMISES:"]
[null,"a. Copy of Menu provided?","N/a",null,null,null,null,null,null,"No copy of the menu for the restaurant to establish trade waste requirements."]
[null,"20. OTHER CHECKSHEETS THAT MAY BE REQUIRED:"]
[null,"a. Form B-062 or B-063 – Application checksheet","N/a",null,null,null,null,null,null,"No B-062 or B-063 - application checksheet "]
[null,"b. Form B-054 – Swimming & spa pools and associated fencing","N/a",null,null,null,null,null,null,"No form B-054 – Swimming and spa pools and associated fences."]
[null,"c. Form B-055 – Solar water heater ","N/a",null,null,null,null,null,null,"No form B-055 – Solar water heater application checksheet."]
[null,"d. Form B-013 – Application for a Certificate for Public Use ","N/a",null,null,null,null,null,null,"No form B-013 – Application for a certificate for public use."]
[null,"e. Form B-041 – Application for Land Subject to a Natural Hazard ","N/a",null,null,null,null,null,null,"No form B-041 – Application for land subject to a natural hazard."]
[null,"f. Form B-042 – Application for a Common Drain Connection","N/a",null,null,null,null,null,null,"No form B-042 – Application for a common drain connection."]
[null,"g. Form B-043 – Form of Consent – Common Drains","N/a",null,null,null,null,null,null,"No form B-043 – Form of consent – common drains."]
[null,"h. Form B-065 – Accessible Facilities Report Template","Y","Page 47 to 55 on the supporting documents - Report has been signed by Adrian Ellis on 2017-2-16",null,null,null,null,null,"No form B-065 – Accessible Facilities Report Template."]
[null,"i. Form B-068 – Section 2 Specified Systems List","Y","Page 5 on the Application form",null,null,null,null,null,"No form B-068 – Section 2 Specified Systems List"]
[null,"j. Form B-052 – Backflow Prevention Device ","N/a",null,null,null,null,null,null,"No form B-052 – Backflow prevention device."]
[null,"DECISION TO ACCEPT BUILDING CONSENT APPLICATION"]
[null,"Reason for accepting application with missing information",null,null,null,null,null,null,null,null,null,null,null,null,null,null,null,null,null,null,null,null,null,null,null,null,null,null,{"$f":"C99","v":0}]
[false,"          Accepted: Having completed the pre-acceptance technical check above, I am satisfied there is sufficient information for the building consent \n          application to be accepted",null,null,null,null,null,null,true,"          Accepted: Having completed the pre-acceptance technical check above, I am satisfied there is sufficient information for the building consent application to be accepted"]
[false,"          Not accepted: Having completed the pre-acceptance technical check above, I am not satisfied there is sufficient information for the building \n          consent application to be accepted",null,null,null,null,null,null,false,"          Not accepted: Having completed the pre-acceptance technical check above, I am not satisfied there is sufficient information for the building consent application to be accepted"]
[null,"Name of person making the acceptance decision:",{"$f":"IF('Summary sheet'!E22=\"\",\"\",'Summary sheet'!E22:E22)","v":"Barjinder jit Singh"}]
[null,"Date of decision:","2017-02-15"]

{"sheet":"App Update","index":2,"n_rows":610,"n_cols":14,"rows_kept":610,"cut":false,"hidden":false,"merged":[[8,5,8,6],[603,1,603,4],[604,1,604,2],[12,1,12,3],[13,1,13,3],[16,1,17,4],[600,1,600,4],[602,1,602,4],[9,1,9,2],[1,1,1,2],[3,1,3,2],[4,1,4,2],[5,1,5,2],[6,1,6,2]]}
[]
[null,{"$f":"TODAY( )","v":"2017-08-20"},null,null,null,"Summary sheet","B501-Not accepted letter"]
[null,null,null,null,null,"Vetting sheet","B501a-Not accepted with invoice"]
[null,{"$f":"'Summary sheet'!$E$7","v":"Trevor Jones "},null,null,null,"B120-Processing sheet","Application update letter"]
[null,{"$f":"'Summary sheet'!E9","v":"47 Second Avenue , Tauranga"},null,null,null,"B150-Structural specialist","B521-RFI letter"]
[null,{"$f":"'Summary sheet'!$E$10","v":"Tauranga"},null,null,null,"B151a-Fire safety specialist","B529-Final reminder letter"]
[null,{"$f":"'Summary sheet'!E8","v":"trevor@architecturaldesigngroup.co.nz"},null,null,null,"B151b-Fire safety specialist","B532-Refusal letter"]
[null,"a","a",null,null,"B160-PS specialist","S71-74 natural hazards"]
[null,"a","a",null,null,"B462-Draft CS"]
[null,{"$f":"\"Dear\"&\" \"&'Summary sheet'!E11","v":"Dear Sir / Madam"}]
[null,"a","a"]
[null,{"$f":"'Summary sheet'!I15&\" \"&'Summary sheet'!E15","v":"Building Consent: BCN/2017/2013"}]
[null,{"$f":"'Summary sheet'!$E$16","v":"80 Byron Street Sydenham "},null,null,null,null,null,null,null,null,null,null,null,{"$f":"B13","v":"80 Byron Street Sydenham "}]
[null,{"$f":"'Summary sheet'!$E$17","v":"Addition to Factory - New Offices, Meeting and Store Room"},null,null,null,null,null,null,null,null,null,null,null,{"$f":"B14","v":"Addition to Factory - New Offices, Meeting and Store Room"}]
[null,"a","a"]
[null,"Application update"]
[null,"There has been a partial review of the above application and the following items have been identified as further information that will be required. Processing of your application is still continuing.\n"]
[]
[null,"a","a"]
[null,"RFI Code\n","RFI Items\n",null,"Status\n"]
[null,"GEN - 001",{"$f":"'B120-Processing sheet'!F15","v":0},null,{"$f":"'B120-Processing sheet'!G15","v":0}]
[null,null,{"$f":"IF('B120-Processing sheet'!F15=\"\",\"\",\"LIST\")","v":""}]
[null,"GEN - 001A",{"$f":"'B120-Processing sheet'!F16","v":0},null,{"$f":"'B120-Processing sheet'!G16","v":0}]
[null,null,{"$f":"IF('B120-Processing sheet'!F16=\"\",\"\",\"LIST\")","v":""}]
[null,"GEN - 001B",{"$f":"'B120-Processing sheet'!F17","v":0},null,{"$f":"'B120-Processing sheet'!G17","v":0}]
[null,null,{"$f":"IF('B120-Processing sheet'!F17=\"\",\"\",\"LIST\")","v":""}]
[null,"GEN - 002",{"$f":"'B120-Processing sheet'!F18","v":0},null,{"$f":"'B120-Processing sheet'!G18","v":0}]
[null,null,{"$f":"IF('B120-Processing sheet'!F18=\"\",\"\",\"LIST\")","v":""}]
[null,"GEN - 003",{"$f":"'B120-Processing sheet'!F19","v":0},null,{"$f":"'B120-Processing sheet'!G19","v":0}]
[null,null,{"$f":"IF('B120-Processing sheet'!F19=\"\",\"\",\"LIST\")","v":""}]
[null,"GEN - 004",{"$f":"'B120-Processing sheet'!F20","v":0},null,{"$f":"'B120-Processing sheet'!G20","v":0}]
[null,null,{"$f":"IF('B120-Processing sheet'!F20=\"\",\"\",\"LIST\")","v":""}]
[null,"GEN - 005",{"$f":"'B120-Processing sheet'!F21","v":0},null,{"$f":"'B120-Processing sheet'!G21","v":0}]
[null,null,{"$f":"IF('B120-Processing sheet'!F21=\"\",\"\",\"LIST\")","v":""}]
[null,"GEN - 006",{"$f":"'B120-Processing sheet'!F22","v":"Provide on the site plan, sufficient levels to establish compliance with [B1, E1, E2, G13, City Plan]. These should include new and existing finished floor levels and site levels to Christchurch Drainage Datum, including datum point location."},null,{"$f":"'B120-Processing sheet'!G22","v":"Resolved"}]
[null,null,{"$f":"IF('B120-Processing sheet'!F22=\"\",\"\",\"LIST\")","v":"LIST"}]
[null,"GEN - 007",{"$f":"'B120-Processing sheet'!F23","v":"Please indicate the location of the block wall on the site plan in relation to the boundary to demonstrate that this building will be constructed within the boundaries of the property (including foundations).\n\n13/07/07 - thank you for your response, however the survey plan suggests that the existing building may be constructed over the boundary. Please confirm that the addition will be constructed wholly within the boundaries of this property, note you will be required to supply a building location certificate at setout of the foundation to confirm that the addition is within the property boundary."},null,{"$f":"'B120-Processing sheet'!G23","v":"Resolved"}]
[null,null,{"$f":"IF('B120-Processing sheet'!F23=\"\",\"\",\"LIST\")","v":"LIST"}]
[null,"GEN - 008",{"$f":"'B120-Processing sheet'!F24","v":0},null,{"$f":"'B120-Processing sheet'!G24","v":0}]
[null,null,{"$f":"IF('B120-Processing sheet'!F24=\"\",\"\",\"LIST\")","v":""}]
[null,"GEN - 009",{"$f":"'B120-Processing sheet'!F25","v":0},null,{"$f":"'B120-Processing sheet'!G25","v":0}]
[null,null,{"$f":"IF('B120-Processing sheet'!F25=\"\",\"\",\"LIST\")","v":""}]
[null,"GEN - 010",{"$f":"'B120-Processing sheet'!F26","v":"Please provide a site specific sediment control plan taking into consideration any drainage outlets that may be existing on site hardstanding area."},null,{"$f":"'B120-Processing sheet'!G26","v":"Resolved"}]
[null,null,{"$f":"IF('B120-Processing sheet'!F26=\"\",\"\",\"LIST\")","v":"LIST"}]
[null,"GEN - 011",{"$f":"'B120-Processing sheet'!F27","v":0},null,{"$f":"'B120-Processing sheet'!G27","v":0}]
[null,null,{"$f":"IF('B120-Processing sheet'!F27=\"\",\"\",\"LIST\")","v":""}]
[null,"GEN - 012",{"$f":"'B120-Processing sheet'!F28","v":"Please provide schedule of construction monitoring that will be conducted by the structural engineer and confirm that a PS4 will be provided when construction complete."},null,{"$f":"'B120-Processing sheet'!G28","v":"Resolved"}]
[null,null,{"$f":"IF('B120-Processing sheet'!F28=\"\",\"\",\"LIST\")","v":"LIST"}]
[null,"BA - 013",{"$f":"'B120-Processing sheet'!F30","v":0},null,{"$f":"'B120-Processing sheet'!G30","v":0}]
[null,null,{"$f":"IF('B120-Processing sheet'!F30=\"\",\"\",\"LIST\")","v":""}]
[null,"B1 - 014",{"$f":"'B120-Processing sheet'!F32","v":0},null,{"$f":"'B120-Processing sheet'!G32","v":0}]
[null,null,{"$f":"IF('B120-Processing sheet'!F32=\"\",\"\",\"LIST\")","v":""}]
[null,"B1 - 015",{"$f":"'B120-Processing sheet'!F33","v":0},null,{"$f":"'B120-Processing sheet'!G33","v":0}]
[null,null,{"$f":"IF('B120-Processing sheet'!F33=\"\",\"\",\"LIST\")","v":""}]
[null,"B1 - 016",{"$f":"'B120-Processing sheet'!F34","v":"1. Please provide a copy of the structural engineering calculations to allow for assessment of compliance with the requirements of B1. RESOLVED\n\n2. Please provide details of how it is intended to connect the new walls to the existing external walls of the building sufficient to demonstrate compliance with requirements of B1 taking into consideration that the design features report indicates that the buildings will be seismically separated however the foundations have been tied together. RESOLVED\n\n3. The information available to Council indicates the presence of external metal structures that appear to be potentially providing additional structural support to the existing building. Please confirm if this is occuring and if so how will that structural element continue to be maintained when the new addition is added. RESOLVED\n\n4. Please provide detail demonstrating how the roof brace in connected to structural elements on Grid line 2 and the central SHS post on Gridline 1 sufficient to demonstrate compliance with the requirements of B1. RESOLVED\n\n5. Please provide documentation to demonstrate that the lateral stability of the stack bond block walls has been achieved sufficient to demonstrate compliance with B1. RESOLVED\n\n6. Please provide a bracing plan and calculations sufficient to demonstrate compliance with the requirements of B1. RESOLVED\n\n7. The lintel above the sliding door appears to be specific design. Please provide documentation to support the size of the lintel indicated in detail 17 sheet A16. RESOLVED\n\n8. The drawings indicate that the opening in the existing wall will be significantly extended. Please provide details of the support for this opening and evidence that the bracing of the existing building can be maintained with this new opening.\n\n14/07/17 - Unable to locate information within engineering calculations as indicated - please direct me to where this information is located."},null,{"$f":"'B120-Processing sheet'!G34","v":"Resolved"}]
[null,null,{"$f":"IF('B120-Processing sheet'!F34=\"\",\"\",\"LIST\")","v":"LIST"}]
[null,"B1 - 017",{"$f":"'B120-Processing sheet'!F35","v":0},null,{"$f":"'B120-Processing sheet'!G35","v":0}]
[null,null,{"$f":"IF('B120-Processing sheet'!F35=\"\",\"\",\"LIST\")","v":""}]
[null,"B1 - 018",{"$f":"'B120-Processing sheet'!F36","v":0},null,{"$f":"'B120-Processing sheet'!G36","v":0}]
[null,null,{"$f":"IF('B120-Processing sheet'!F36=\"\",\"\",\"LIST\")","v":""}]
[null,"B1 - 019",{"$f":"'B120-Processing sheet'!F37","v":0},null,{"$f":"'B120-Processing sheet'!G37","v":0}]
[null,null,{"$f":"IF('B120-Processing sheet'!F37=\"\",\"\",\"LIST\")","v":""}]
[null,"B1 - 020",{"$f":"'B120-Processing sheet'!F38","v":"As this project involves connection with the existing building please provide a Detailed Engineering Evaluation (DEE) for the existing building.\n\n13/07/17 - Your response refers to a report by Holmes Consulting, however no report was received"},null,{"$f":"'B120-Processing sheet'!G38","v":"Resolved"}]
[null,null,{"$f":"IF('B120-Processing sheet'!F38=\"\",\"\",\"LIST\")","v":"LIST"}]
[null,"B1 - 021",{"$f":"'B120-Processing sheet'!F39","v":0},null,{"$f":"'B120-Processing sheet'!G39","v":0}]
[null,null,{"$f":"IF('B120-Processing sheet'!F39=\"\",\"\",\"LIST\")","v":""}]
[null,"B1 - 022",{"$f":"'B120-Processing sheet'!F41","v":0},null,{"$f":"'B120-Processing sheet'!G41","v":0}]
[null,null,{"$f":"IF('B120-Processing sheet'!F41=\"\",\"\",\"LIST\")","v":""}]
[null,"B1 - 023",{"$f":"'B120-Processing sheet'!F42","v":0},null,{"$f":"'B120-Processing sheet'!G42","v":0}]
[null,null,{"$f":"IF('B120-Processing sheet'!F42=\"\",\"\",\"LIST\")","v":""}]
[null,"B1 - 024",{"$f":"'B120-Processing sheet'!F43","v":0},null,{"$f":"'B120-Processing sheet'!G43","v":0}]
[null,null,{"$f":"IF('B120-Processing sheet'!F43=\"\",\"\",\"LIST\")","v":""}]
[null,"B1 - 025",{"$f":"'B120-Processing sheet'!F44","v":0},null,{"$f":"'B120-Processing sheet'!G44","v":0}]
[null,null,{"$f":"IF('B120-Processing sheet'!F44=\"\",\"\",\"LIST\")","v":""}]
[null,"B1 - 026",{"$f":"'B120-Processing sheet'!F45","v":0},null,{"$f":"'B120-Processing sheet'!G45","v":0}]
[null,null,{"$f":"IF('B120-Processing sheet'!F45=\"\",\"\",\"LIST\")","v":""}]
[null,"B1 - 027",{"$f":"'B120-Processing sheet'!F46","v":0},null,{"$f":"'B120-Processing sheet'!G46","v":0}]
[null,null,{"$f":"IF('B120-Processing sheet'!F46=\"\",\"\",\"LIST\")","v":""}]
[null,"B1 - 028",{"$f":"'B120-Processing sheet'!F47","v":0},null,{"$f":"'B120-Processing sheet'!G47","v":0}]
[null,null,{"$f":"IF('B120-Processing sheet'!F47=\"\",\"\",\"LIST\")","v":""}]
[null,"B1 - 029",{"$f":"'B120-Processing sheet'!F48","v":0},null,{"$f":"'B120-Processing sheet'!G48","v":0}]
[null,null,{"$f":"IF('B120-Processing sheet'!F48=\"\",\"\",\"LIST\")","v":""}]
[null,"B1 - 030",{"$f":"'B120-Processing sheet'!F49","v":0},null,{"$f":"'B120-Processing sheet'!G49","v":0}]
[null,null,{"$f":"IF('B120-Processing sheet'!F49=\"\",\"\",\"LIST\")","v":""}]
[null,"B1 - 031",{"$f":"'B120-Processing sheet'!F50","v":0},null,{"$f":"'B120-Processing sheet'!G50","v":0}]
[null,null,{"$f":"IF('B120-Processing sheet'!F50=\"\",\"\",\"LIST\")","v":""}]
[null,"B1 - 032",{"$f":"'B120-Processing sheet'!F51","v":0},null,{"$f":"'B120-Processing sheet'!G51","v":0}]
[null,null,{"$f":"IF('B120-Processing sheet'!F51=\"\",\"\",\"LIST\")","v":""}]
[null,"B1 - 033",{"$f":"'B120-Processing sheet'!F52","v":0},null,{"$f":"'B120-Processing sheet'!G52","v":0}]
[null,null,{"$f":"IF('B120-Processing sheet'!F52=\"\",\"\",\"LIST\")","v":""}]
[null,"B1 - 034",{"$f":"'B120-Processing sheet'!F53","v":0},null,{"$f":"'B120-Processing sheet'!G53","v":0}]
[null,null,{"$f":"IF('B120-Processing sheet'!F53=\"\",\"\",\"LIST\")","v":""}]
[null,"B1 - 035",{"$f":"'B120-Processing sheet'!F54","v":0},null,{"$f":"'B120-Processing sheet'!G54","v":0}]
[null,null,{"$f":"IF('B120-Processing sheet'!F54=\"\",\"\",\"LIST\")","v":""}]
[null,"B1 - 036",{"$f":"'B120-Processing sheet'!F55","v":0},null,{"$f":"'B120-Processing sheet'!G55","v":0}]
[null,null,{"$f":"IF('B120-Processing sheet'!F55=\"\",\"\",\"LIST\")","v":""}]
[null,"B1 - 037",{"$f":"'B120-Processing sheet'!F56","v":0},null,{"$f":"'B120-Processing sheet'!G56","v":0}]
[null,null,{"$f":"IF('B120-Processing sheet'!F56=\"\",\"\",\"LIST\")","v":""}]
[null,"B1 - 038",{"$f":"'B120-Processing sheet'!F57","v":0},null,{"$f":"'B120-Processing sheet'!G57","v":0}]
[null,null,{"$f":"IF('B120-Processing sheet'!F57=\"\",\"\",\"LIST\")","v":""}]
[null,"B1 - 039",{"$f":"'B120-Processing sheet'!F58","v":0},null,{"$f":"'B120-Processing sheet'!G58","v":0}]
[null,null,{"$f":"IF('B120-Processing sheet'!F58=\"\",\"\",\"LIST\")","v":""}]
[null,"B1 - 040",{"$f":"'B120-Processing sheet'!F59","v":0},null,{"$f":"'B120-Processing sheet'!G59","v":0}]
[null,null,{"$f":"IF('B120-Processing sheet'!F59=\"\",\"\",\"LIST\")","v":""}]
[null,"B1 - 041",{"$f":"'B120-Processing sheet'!F60","v":0},null,{"$f":"'B120-Processing sheet'!G60","v":0}]
[null,null,{"$f":"IF('B120-Processing sheet'!F60=\"\",\"\",\"LIST\")","v":""}]
[null,"B1 - 042",{"$f":"'B120-Processing sheet'!F61","v":0},null,{"$f":"'B120-Processing sheet'!G61","v":0}]
[null,null,{"$f":"IF('B120-Processing sheet'!F61=\"\",\"\",\"LIST\")","v":""}]
[null,"B1 - 043",{"$f":"'B120-Processing sheet'!F62","v":0},null,{"$f":"'B120-Processing sheet'!G62","v":0}]
[null,null,{"$f":"IF('B120-Processing sheet'!F62=\"\",\"\",\"LIST\")","v":""}]
[null,"B1 - 044",{"$f":"'B120-Processing sheet'!F63","v":0},null,{"$f":"'B120-Processing sheet'!G63","v":0}]
[null,null,{"$f":"IF('B120-Processing sheet'!F63=\"\",\"\",\"LIST\")","v":""}]
[null,"B1 - 045",{"$f":"'B120-Processing sheet'!F64","v":0},null,{"$f":"'B120-Processing sheet'!G64","v":0}]
[null,null,{"$f":"IF('B120-Processing sheet'!F64=\"\",\"\",\"LIST\")","v":""}]
[null,"B1 - 046",{"$f":"'B120-Processing sheet'!F65","v":0},null,{"$f":"'B120-Processing sheet'!G65","v":0}]
[null,null,{"$f":"IF('B120-Processing sheet'!F65=\"\",\"\",\"LIST\")","v":""}]
[null,"B1 - 047",{"$f":"'B120-Processing sheet'!F66","v":0},null,{"$f":"'B120-Processing sheet'!G66","v":0}]
[null,null,{"$f":"IF('B120-Processing sheet'!F66=\"\",\"\",\"LIST\")","v":""}]
[null,"B1 - 048",{"$f":"'B120-Processing sheet'!F67","v":0},null,{"$f":"'B120-Processing sheet'!G67","v":0}]
[null,null,{"$f":"IF('B120-Processing sheet'!F67=\"\",\"\",\"LIST\")","v":""}]
[null,"B1 - 049",{"$f":"'B120-Processing sheet'!F68","v":"Please review the internal wall framing spacings taking into consideration the wall height of 2.7m. 90x45 @ 600mm centres does not meet the requirements of Table 8.2 NZS3604:2011."},null,{"$f":"'B120-Processing sheet'!G68","v":"Resolved"}]
[null,null,{"$f":"IF('B120-Processing sheet'!F68=\"\",\"\",\"LIST\")","v":"LIST"}]
[null,"B1 - 050",{"$f":"'B120-Processing sheet'!F69","v":0},null,{"$f":"'B120-Processing sheet'!G69","v":0}]
[null,null,{"$f":"IF('B120-Processing sheet'!F69=\"\",\"\",\"LIST\")","v":""}]
[null,"B1 - 051",{"$f":"'B120-Processing sheet'!F70","v":0},null,{"$f":"'B120-Processing sheet'!G70","v":0}]
[null,null,{"$f":"IF('B120-Processing sheet'!F70=\"\",\"\",\"LIST\")","v":""}]
[null,"B1 - 052",{"$f":"'B120-Processing sheet'!F71","v":0},null,{"$f":"'B120-Processing sheet'!G71","v":0}]
[null,null,{"$f":"IF('B120-Processing sheet'!F71=\"\",\"\",\"LIST\")","v":""}]
[null,"B1 - 053",{"$f":"'B120-Processing sheet'!F72","v":0},null,{"$f":"'B120-Processing sheet'!G72","v":0}]
[null,null,{"$f":"IF('B120-Processing sheet'!F72=\"\",\"\",\"LIST\")","v":""}]
[null,"B1 - 054",{"$f":"'B120-Processing sheet'!F73","v":0},null,{"$f":"'B120-Processing sheet'!G73","v":0}]
[null,null,{"$f":"IF('B120-Processing sheet'!F73=\"\",\"\",\"LIST\")","v":""}]
[null,"B1 - 055",{"$f":"'B120-Processing sheet'!F74","v":"Detail 11 sheet A15 indicates the presence of outriggers please provide sufficient details to demonstrate compliance with B1. A roof framing plan may be appropriate which includes length of outrigger over hang and the support for the metal roofing at the eave."},null,{"$f":"'B120-Processing sheet'!G74","v":"Resolved"}]
[null,null,{"$f":"IF('B120-Processing sheet'!F74=\"\",\"\",\"LIST\")","v":"LIST"}]
[null,"B1 - 056",{"$f":"'B120-Processing sheet'!F75","v":0},null,{"$f":"'B120-Processing sheet'!G75","v":0}]
[null,null,{"$f":"IF('B120-Processing sheet'!F75=\"\",\"\",\"LIST\")","v":""}]
[null,"B1 - 057",{"$f":"'B120-Processing sheet'!F76","v":0},null,{"$f":"'B120-Processing sheet'!G76","v":0}]
[null,null,{"$f":"IF('B120-Processing sheet'!F76=\"\",\"\",\"LIST\")","v":""}]
[null,"B1 - 058",{"$f":"'B120-Processing sheet'!F77","v":0},null,{"$f":"'B120-Processing sheet'!G77","v":0}]
[null,null,{"$f":"IF('B120-Processing sheet'!F77=\"\",\"\",\"LIST\")","v":""}]
[null,"B1 - 059",{"$f":"'B120-Processing sheet'!F78","v":0},null,{"$f":"'B120-Processing sheet'!G78","v":0}]
[null,null,{"$f":"IF('B120-Processing sheet'!F78=\"\",\"\",\"LIST\")","v":""}]
[null,"B1 - 060",{"$f":"'B120-Processing sheet'!F79","v":0},null,{"$f":"'B120-Processing sheet'!G79","v":0}]
[null,null,{"$f":"IF('B120-Processing sheet'!F79=\"\",\"\",\"LIST\")","v":""}]
[null,"B1 - 061",{"$f":"'B120-Processing sheet'!F80","v":0},null,{"$f":"'B120-Processing sheet'!G80","v":0}]
[null,null,{"$f":"IF('B120-Processing sheet'!F80=\"\",\"\",\"LIST\")","v":""}]
[null,"B1 - 062",{"$f":"'B120-Processing sheet'!F81","v":0},null,{"$f":"'B120-Processing sheet'!G81","v":0}]
[null,null,{"$f":"IF('B120-Processing sheet'!F81=\"\",\"\",\"LIST\")","v":""}]
[null,"B2 - 063",{"$f":"'B120-Processing sheet'!F83","v":0},null,{"$f":"'B120-Processing sheet'!G83","v":0}]
[null,null,{"$f":"IF('B120-Processing sheet'!F83=\"\",\"\",\"LIST\")","v":""}]
[null,"B2 - 064",{"$f":"'B120-Processing sheet'!F84","v":"Please provide finished floor level for the addition. Whilst it is noted that the building does not need to meet the requirements of E1, it will be required to achieve compliance with 50 year durability requirements. As the internal of the building consistents of structural elements which are susceptible to the impact of moisture please provide details of how it is intended to ensure the structural integrity of these elements.\n\n13/07/17 - thank you for the revised detail for the internal walls, however it has been noted there is a timber external wall which provides some structural support and will also require protection. Please review/revise as appropriate."},null,{"$f":"'B120-Processing sheet'!G84","v":"Resolved"}]
[null,null,{"$f":"IF('B120-Processing sheet'!F84=\"\",\"\",\"LIST\")","v":"LIST"}]
[null,"B2 - 065",{"$f":"'B120-Processing sheet'!F85","v":0},null,{"$f":"'B120-Processing sheet'!G85","v":0}]
[null,null,{"$f":"IF('B120-Processing sheet'!F85=\"\",\"\",\"LIST\")","v":""}]
[null,"B2 - 066",{"$f":"'B120-Processing sheet'!F86","v":0},null,{"$f":"'B120-Processing sheet'!G86","v":0}]
[null,null,{"$f":"IF('B120-Processing sheet'!F86=\"\",\"\",\"LIST\")","v":""}]
[null,"B2 - 067",{"$f":"'B120-Processing sheet'!F87","v":0},null,{"$f":"'B120-Processing sheet'!G87","v":0}]
[null,null,{"$f":"IF('B120-Processing sheet'!F87=\"\",\"\",\"LIST\")","v":""}]
[null,"B2 - 068",{"$f":"'B120-Processing sheet'!F88","v":0},null,{"$f":"'B120-Processing sheet'!G88","v":0}]
[null,null,{"$f":"IF('B120-Processing sheet'!F88=\"\",\"\",\"LIST\")","v":""}]
[null,"C1 - 069",{"$f":"'B120-Processing sheet'!F90","v":0},null,{"$f":"'B120-Processing sheet'!G90","v":0}]
[null,null,{"$f":"IF('B120-Processing sheet'!F90=\"\",\"\",\"LIST\")","v":""}]
[null,"D1 – 070",{"$f":"'B120-Processing sheet'!F92","v":0},null,{"$f":"'B120-Processing sheet'!G92","v":0}]
[null,null,{"$f":"IF('B120-Processing sheet'!F92=\"\",\"\",\"LIST\")","v":""}]
[null,"D1 – 071",{"$f":"'B120-Processing sheet'!F93","v":0},null,{"$f":"'B120-Processing sheet'!G93","v":0}]
[null,null,{"$f":"IF('B120-Processing sheet'!F93=\"\",\"\",\"LIST\")","v":""}]
[null,"D1 – 072",{"$f":"'B120-Processing sheet'!F94","v":0},null,{"$f":"'B120-Processing sheet'!G94","v":0}]
[null,null,{"$f":"IF('B120-Processing sheet'!F94=\"\",\"\",\"LIST\")","v":""}]
[null,"D1 – 073",{"$f":"'B120-Processing sheet'!F95","v":0},null,{"$f":"'B120-Processing sheet'!G95","v":0}]
[null,null,{"$f":"IF('B120-Processing sheet'!F95=\"\",\"\",\"LIST\")","v":""}]
[null,"D1 – 074",{"$f":"'B120-Processing sheet'!F96","v":"1. Please provide finished floor level between the existing and new floors sufficient to demonstrate compliance with the requirement of D1 in relation to isolated steps. RESOLVED\n\n2. Please review detail 18 sheet A16. The installation of the channel drain 100mm below the finished floor level and also door sill indicates the presence of an isolated step at this entrance which does not comply with the requirements of D1.\n\n13/07/17 - Thank you for the revised detail, however the dimensions provide are not within the scope of D1/AS1 4.1.1 and figure 11 ie risers of less than 150mm (less than 23 degree pitch) are not acceptable - Please review as appropriate. For this to be reviewed as an alterntive solution sufficient information to demonstrate compliance with D1 will be required.\n\n02/08/17 - Thank you for the details, however as you have indicated two risers please provide the details of the handrail sufficient to demonstrate compliance with the requirements of D1.3.2(K)."},null,{"$f":"'B120-Processing sheet'!G96","v":"Resolved"}]
[null,null,{"$f":"IF('B120-Processing sheet'!F96=\"\",\"\",\"LIST\")","v":"LIST"}]
[null,"D1 – 075",{"$f":"'B120-Processing sheet'!F97","v":0},null,{"$f":"'B120-Processing sheet'!G97","v":0}]
[null,null,{"$f":"IF('B120-Processing sheet'!F97=\"\",\"\",\"LIST\")","v":""}]
[null,"D1 – 076",{"$f":"'B120-Processing sheet'!F98","v":0},null,{"$f":"'B120-Processing sheet'!G98","v":0}]
[null,null,{"$f":"IF('B120-Processing sheet'!F98=\"\",\"\",\"LIST\")","v":""}]
[null,"D1 – 077",{"$f":"'B120-Processing sheet'!F99","v":0},null,{"$f":"'B120-Processing sheet'!G99","v":0}]
[null,null,{"$f":"IF('B120-Processing sheet'!F99=\"\",\"\",\"LIST\")","v":""}]
[null,"D1 – 078",{"$f":"'B120-Processing sheet'!F100","v":"Please provide a sill detail for door indicated on the East side of the addition sufficient to demonstrate compliance with the requirements of D1 and E2 in relation to accessible route."},null,{"$f":"'B120-Processing sheet'!G100","v":"Resolved"}]
[null,null,{"$f":"IF('B120-Processing sheet'!F100=\"\",\"\",\"LIST\")","v":"LIST"}]
[null,"D1 – 079",{"$f":"'B120-Processing sheet'!F101","v":0},null,{"$f":"'B120-Processing sheet'!G101","v":0}]
[null,null,{"$f":"IF('B120-Processing sheet'!F101=\"\",\"\",\"LIST\")","v":""}]
[null,"D1 – 080",{"$f":"'B120-Processing sheet'!F102","v":0},null,{"$f":"'B120-Processing sheet'!G102","v":0}]
[null,null,{"$f":"IF('B120-Processing sheet'!F102=\"\",\"\",\"LIST\")","v":""}]
[null,"D1 – 081",{"$f":"'B120-Processing sheet'!F103","v":0},null,{"$f":"'B120-Processing sheet'!G103","v":0}]
[null,null,{"$f":"IF('B120-Processing sheet'!F103=\"\",\"\",\"LIST\")","v":""}]
[null,"D1 – 082",{"$f":"'B120-Processing sheet'!F104","v":0},null,{"$f":"'B120-Processing sheet'!G104","v":0}]
[null,null,{"$f":"IF('B120-Processing sheet'!F104=\"\",\"\",\"LIST\")","v":""}]
[null,"D1 – 083",{"$f":"'B120-Processing sheet'!F105","v":0},null,{"$f":"'B120-Processing sheet'!G105","v":0}]
[null,null,{"$f":"IF('B120-Processing sheet'!F105=\"\",\"\",\"LIST\")","v":""}]
[null,"D1 – 084",{"$f":"'B120-Processing sheet'!F106","v":0},null,{"$f":"'B120-Processing sheet'!G106","v":0}]
[null,null,{"$f":"IF('B120-Processing sheet'!F106=\"\",\"\",\"LIST\")","v":""}]
[null,"D1 – 085",{"$f":"'B120-Processing sheet'!F107","v":0},null,{"$f":"'B120-Processing sheet'!G107","v":0}]
[null,null,{"$f":"IF('B120-Processing sheet'!F107=\"\",\"\",\"LIST\")","v":""}]
[null,"D2 – 086",{"$f":"'B120-Processing sheet'!F109","v":0},null,{"$f":"'B120-Processing sheet'!G109","v":0}]
[null,null,{"$f":"IF('B120-Processing sheet'!F109=\"\",\"\",\"LIST\")","v":""}]
[null,"D2 – 087",{"$f":"'B120-Processing sheet'!F110","v":0},null,{"$f":"'B120-Processing sheet'!G110","v":0}]
[null,null,{"$f":"IF('B120-Processing sheet'!F110=\"\",\"\",\"LIST\")","v":""}]
[null,"E1 – 088",{"$f":"'B120-Processing sheet'!F112","v":0},null,{"$f":"'B120-Processing sheet'!G112","v":0}]
[null,null,{"$f":"IF('B120-Processing sheet'!F112=\"\",\"\",\"LIST\")","v":""}]
[null,"E1 – 089",{"$f":"'B120-Processing sheet'!F113","v":"Please provide FFL and the ground to  floor separation. 13/07/2017 Resolved See TRIM 17/741973"},null,{"$f":"'B120-Processing sheet'!G113","v":"Resolved"}]
[null,null,{"$f":"IF('B120-Processing sheet'!F113=\"\",\"\",\"LIST\")","v":"LIST"}]
[null,"E1 – 090",{"$f":"'B120-Processing sheet'!F114","v":"• Authorisation For The Discharge Of Stormwater Into CCC Network: To comply with the New Zealand Building Code stormwater discharge from this property must avoid the likelihood of damage to the outfall in a manner acceptable to the Council’s Assets And Network Unit. In addition, the Council requires stormwater discharge compliance with Environment Canterbury’s regional rules and holds a number of discharge consents throughout its territory which it may use to authorise the discharge of stormwater into its network. Compliance with relevant consent conditions may require onsite stormwater mitigation (treatment and/or attenuation/disposal). Before a Building Consent can be issued you must seek authorisation from Council’s Assets And Network Unit by contacting Stormwater.Approvals@ccc.govt.nz. If Council does not authorise the stormwater discharge under one of its global consents, separate authorisation from Environment Canterbury may be required prior to a Building Consent being issued. The obtained authorisation must be included with the supporting documents of your building consent application.  13/07/2017 Resolved See TRIM 17/363256"},null,{"$f":"'B120-Processing sheet'!G114","v":"Resolved"}]
[null,null,{"$f":"IF('B120-Processing sheet'!F114=\"\",\"\",\"LIST\")","v":"LIST"}]
[null,"E1 – 091",{"$f":"'B120-Processing sheet'!F115","v":"Please provide the grade and pipe size  of the existing stormwater pipe to be disconnected so that the adequacy of the proposed design draining the additional proposed building can be ascertained. In addition please provide the pipe grade of the proposed stormwater pipe on drawing A4. 13/07/2017 Resolved See TRIM 17/741973"},null,{"$f":"'B120-Processing sheet'!G115","v":"Resolved"}]
[null,null,{"$f":"IF('B120-Processing sheet'!F115=\"\",\"\",\"LIST\")","v":"LIST"}]
[null,"E1 – 092",{"$f":"'B120-Processing sheet'!F116","v":0},null,{"$f":"'B120-Processing sheet'!G116","v":0}]
[null,null,{"$f":"IF('B120-Processing sheet'!F116=\"\",\"\",\"LIST\")","v":""}]
[null,"E1 – 093",{"$f":"'B120-Processing sheet'!F117","v":0},null,{"$f":"'B120-Processing sheet'!G117","v":0}]
[null,null,{"$f":"IF('B120-Processing sheet'!F117=\"\",\"\",\"LIST\")","v":""}]
[null,"E1 – 094",{"$f":"'B120-Processing sheet'!F118","v":0},null,{"$f":"'B120-Processing sheet'!G118","v":0}]
[null,null,{"$f":"IF('B120-Processing sheet'!F118=\"\",\"\",\"LIST\")","v":""}]
[null,"E1 – 095",{"$f":"'B120-Processing sheet'!F119","v":"Please provide the size of the proposed overflows on drawing A19  13/07/2017 Resolved See TRIM 17/741973"},null,{"$f":"'B120-Processing sheet'!G119","v":"Resolved"}]
[null,null,{"$f":"IF('B120-Processing sheet'!F119=\"\",\"\",\"LIST\")","v":"LIST"}]
[null,"E2 – 096",{"$f":"'B120-Processing sheet'!F121","v":0},null,{"$f":"'B120-Processing sheet'!G121","v":0}]
[null,null,{"$f":"IF('B120-Processing sheet'!F121=\"\",\"\",\"LIST\")","v":""}]
[null,"E2 – 097",{"$f":"'B120-Processing sheet'!F122","v":0},null,{"$f":"'B120-Processing sheet'!G122","v":0}]
[null,null,{"$f":"IF('B120-Processing sheet'!F122=\"\",\"\",\"LIST\")","v":""}]
[null,"E2 – 098",{"$f":"'B120-Processing sheet'!F123","v":"Please note on elevations the surface finish for the blockwalls sufficient to demonstrate compliance with the requirements of E2."},null,{"$f":"'B120-Processing sheet'!G123","v":"Resolved"}]
[null,null,{"$f":"IF('B120-Processing sheet'!F123=\"\",\"\",\"LIST\")","v":"LIST"}]
[null,"E2 – 099",{"$f":"'B120-Processing sheet'!F124","v":0},null,{"$f":"'B120-Processing sheet'!G124","v":0}]
[null,null,{"$f":"IF('B120-Processing sheet'!F124=\"\",\"\",\"LIST\")","v":""}]
[null,"E2 – 100",{"$f":"'B120-Processing sheet'!F125","v":"1. Please provide cladding details for all junctions sufficient to demonstrate compliance with requirements of E2. This should include but is not limited to the vertical metal cladding to blockwall both vertical junction and internal corner and internal corner for existing metal cladding to new block wall. RESOLVED\n\n2. If it is intended to have the new element structurally seismically separate from the existing building (as identified in the structural engineers design features report), please provide details for the junctions between the new and existing walls sufficient to demonstrate compliance with the requirements of E2.\n\n13/07/17 - Thank you for the additional details. Please review detail 23 Sheet A22. It appears the existing metal wall cladding is shown as continuous within the seismic gap required. Also Detail 24 same sheet indicates the presence of blocking within this seismic gap. Please remove from details to ensure full depth of seismic separation is maintained. RESOLVED\n\n13/07/17 - NEW - please provide a detail for the junction between existing block wall and new blockwall located on the boundary - this detail should reflect the requirement for seismic separation that has been indicated throughout consent documents. Note detail 7 will need to be revised to reflect this requirement and to remove the metal cladding indicated within the seismic gap.\n\n02/08/17 - Thank you for the details provided, however please review detail 28 sheet A22. The gap between the new and existing blockwall is shown to be only 10mm, whereas there is a requirement for 50mm seismic separation. As these are both structural elements the 50mm separation is required to be maintained in this location. Note that as the gap will now exceed 0.1m² (3.5x0.050m) this gap will need to be firerated to the same rating as the wall which is shown to be 120 minute FRR."},null,{"$f":"'B120-Processing sheet'!G125","v":"Resolved"}]
[null,null,{"$f":"IF('B120-Processing sheet'!F125=\"\",\"\",\"LIST\")","v":"LIST"}]
[null,"E2 – 101",{"$f":"'B120-Processing sheet'!F126","v":0},null,{"$f":"'B120-Processing sheet'!G126","v":0}]
[null,null,{"$f":"IF('B120-Processing sheet'!F126=\"\",\"\",\"LIST\")","v":""}]
[null,"E2 – 102",{"$f":"'B120-Processing sheet'!F128","v":0},null,{"$f":"'B120-Processing sheet'!G128","v":0}]
[null,null,{"$f":"IF('B120-Processing sheet'!F128=\"\",\"\",\"LIST\")","v":""}]
[null,"E2 – 103",{"$f":"'B120-Processing sheet'!F129","v":"1. Please provide apron flashing detail for where existing vertical metal wall cladding junctions with new metal roof cladding sufficient to demonstrate compliance with the requirements of E2 and taking into consideration the seismic separation of the new and existing building if appropriate.\n\n2. Please provide rainwater head penetration detail sufficient to demonstrate compliance with the requirements of E2.\n\n3. The North elevation indicates the potential for a clash between the existing external steel (braced) poles and the eave to the east elevation. Please provide sufficient detail to demonstrate compliance with the requirements of E2 at this location."},null,{"$f":"'B120-Processing sheet'!G129","v":"Resolved"}]
[null,null,{"$f":"IF('B120-Processing sheet'!F129=\"\",\"\",\"LIST\")","v":"LIST"}]
[null,"E2 – 104",{"$f":"'B120-Processing sheet'!F130","v":"1. Please provide wall to soffit junction for the raking soffit (greater than 90 degree eave) sufficient to demonstrate compliance with the requirements of E2.\n\n2. Please provide barge detail for junction with both blockwall and vertical metal wall cladding sufficient to demonstrate compliance with the requirements of E2."},null,{"$f":"'B120-Processing sheet'!G130","v":"Resolved"}]
[null,null,{"$f":"IF('B120-Processing sheet'!F130=\"\",\"\",\"LIST\")","v":"LIST"}]
[null,"E2 – 105",{"$f":"'B120-Processing sheet'!F131","v":0},null,{"$f":"'B120-Processing sheet'!G131","v":0}]
[null,null,{"$f":"IF('B120-Processing sheet'!F131=\"\",\"\",\"LIST\")","v":""}]
[null,"E2 – 106",{"$f":"'B120-Processing sheet'!F132","v":0},null,{"$f":"'B120-Processing sheet'!G132","v":0}]
[null,null,{"$f":"IF('B120-Processing sheet'!F132=\"\",\"\",\"LIST\")","v":""}]
[null,"E2 – 107",{"$f":"'B120-Processing sheet'!F133","v":0},null,{"$f":"'B120-Processing sheet'!G133","v":0}]
[null,null,{"$f":"IF('B120-Processing sheet'!F133=\"\",\"\",\"LIST\")","v":""}]
[null,"E2 – 108",{"$f":"'B120-Processing sheet'!F134","v":"Please provide internal gutter detail which indicates extent and all material layers sufficient to demonstrate compliance with the requirements of E2."},null,{"$f":"'B120-Processing sheet'!G134","v":"Resolved"}]
[null,null,{"$f":"IF('B120-Processing sheet'!F134=\"\",\"\",\"LIST\")","v":"LIST"}]
[null,"E2 – 109",{"$f":"'B120-Processing sheet'!F135","v":"1. Please review skylight penetration detail A sheet A20. It appears to reflect skylight located near roof edge (barge) which is not applicable for this application. The drawings appear to suggest the use of a diverter/cricket flashing which there has been no details provided.\n\n2. Please provide pipe roof penetration detail for the terminal vent pentration indicated on sheet A19 sufficient to demonstrate compliance with the requirements of E2."},null,{"$f":"'B120-Processing sheet'!G135","v":"Resolved"}]
[null,null,{"$f":"IF('B120-Processing sheet'!F135=\"\",\"\",\"LIST\")","v":"LIST"}]
[null,"E2 – 110",{"$f":"'B120-Processing sheet'!F136","v":0},null,{"$f":"'B120-Processing sheet'!G136","v":0}]
[null,null,{"$f":"IF('B120-Processing sheet'!F136=\"\",\"\",\"LIST\")","v":""}]
[null,"E2 – 111",{"$f":"'B120-Processing sheet'!F137","v":0},null,{"$f":"'B120-Processing sheet'!G137","v":0}]
[null,null,{"$f":"IF('B120-Processing sheet'!F137=\"\",\"\",\"LIST\")","v":""}]
[null,"E2 – 112",{"$f":"'B120-Processing sheet'!F138","v":0},null,{"$f":"'B120-Processing sheet'!G138","v":0}]
[null,null,{"$f":"IF('B120-Processing sheet'!F138=\"\",\"\",\"LIST\")","v":""}]
[null,"E2 – 113",{"$f":"'B120-Processing sheet'!F139","v":0},null,{"$f":"'B120-Processing sheet'!G139","v":0}]
[null,null,{"$f":"IF('B120-Processing sheet'!F139=\"\",\"\",\"LIST\")","v":""}]
[null,"E2 – 114",{"$f":"'B120-Processing sheet'!F140","v":"1. Please confirm that the membrane extends beyond the blockwall window sill sufficient to demonstrate compliance with the requirements of E2.\n\n2. Please review the head flashing detail for the block wall penetrations sufficient to demonstrate compliance with the requirements of E2. ie no drip edge provided."},null,{"$f":"'B120-Processing sheet'!G140","v":"Resolved"}]
[null,null,{"$f":"IF('B120-Processing sheet'!F140=\"\",\"\",\"LIST\")","v":"LIST"}]
[null,"E2 – 115",{"$f":"'B120-Processing sheet'!F141","v":0},null,{"$f":"'B120-Processing sheet'!G141","v":0}]
[null,null,{"$f":"IF('B120-Processing sheet'!F141=\"\",\"\",\"LIST\")","v":""}]
[null,"E3 – 116",{"$f":"'B120-Processing sheet'!F143","v":0},null,{"$f":"'B120-Processing sheet'!G143","v":0}]
[null,null,{"$f":"IF('B120-Processing sheet'!F143=\"\",\"\",\"LIST\")","v":""}]
[null,"E3 – 117",{"$f":"'B120-Processing sheet'!F144","v":0},null,{"$f":"'B120-Processing sheet'!G144","v":0}]
[null,null,{"$f":"IF('B120-Processing sheet'!F144=\"\",\"\",\"LIST\")","v":""}]
[null,"E3 – 118",{"$f":"'B120-Processing sheet'!F145","v":0},null,{"$f":"'B120-Processing sheet'!G145","v":0}]
[null,null,{"$f":"IF('B120-Processing sheet'!F145=\"\",\"\",\"LIST\")","v":""}]
[null,"E3 – 119",{"$f":"'B120-Processing sheet'!F146","v":0},null,{"$f":"'B120-Processing sheet'!G146","v":0}]
[null,null,{"$f":"IF('B120-Processing sheet'!F146=\"\",\"\",\"LIST\")","v":""}]
[null,"F1 – 120",{"$f":"'B120-Processing sheet'!F148","v":0},null,{"$f":"'B120-Processing sheet'!$G$148","v":0}]
[null,null,{"$f":"IF('B120-Processing sheet'!F148=\"\",\"\",\"LIST\")","v":""}]
[null,"F2 – 121",{"$f":"'B120-Processing sheet'!F150","v":0},null,{"$f":"'B120-Processing sheet'!G150","v":0}]
[null,null,{"$f":"IF('B120-Processing sheet'!F150=\"\",\"\",\"LIST\")","v":""}]
[null,"F2 – 122",{"$f":"'B120-Processing sheet'!F151","v":"Please confirm the presence of manifestation to glazing panels capable of being mistaken for an unimpeded path sufficient to demonstrate compliance with the requirements of F2 ie side panels for sliding doors."},null,{"$f":"'B120-Processing sheet'!G151","v":"Resolved"}]
[null,null,{"$f":"IF('B120-Processing sheet'!F151=\"\",\"\",\"LIST\")","v":"LIST"}]
[null,"F2 – 123",{"$f":"'B120-Processing sheet'!F152","v":0},null,{"$f":"'B120-Processing sheet'!G152","v":0}]
[null,null,{"$f":"IF('B120-Processing sheet'!F152=\"\",\"\",\"LIST\")","v":""}]
[null,"F3 – 124",{"$f":"'B120-Processing sheet'!F154","v":"Please advise if it is intended to store or use any hazardous substances within this new building element, if so please provide sufficient documentation to demonstrate compliance with the requirements of F3."},null,{"$f":"'B120-Processing sheet'!G154","v":"Resolved"}]
[null,null,{"$f":"IF('B120-Processing sheet'!F154=\"\",\"\",\"LIST\")","v":"LIST"}]
[null,"F3 – 125",{"$f":"'B120-Processing sheet'!F155","v":0},null,{"$f":"'B120-Processing sheet'!G155","v":0}]
[null,null,{"$f":"IF('B120-Processing sheet'!F155=\"\",\"\",\"LIST\")","v":""}]
[null,"F4 – 126",{"$f":"'B120-Processing sheet'!F157","v":0},null,{"$f":"'B120-Processing sheet'!G157","v":0}]
[null,null,{"$f":"IF('B120-Processing sheet'!F157=\"\",\"\",\"LIST\")","v":""}]
[null,"F4 – 127",{"$f":"'B120-Processing sheet'!F158","v":0},null,{"$f":"'B120-Processing sheet'!G158","v":0}]
[null,null,{"$f":"IF('B120-Processing sheet'!F158=\"\",\"\",\"LIST\")","v":""}]
[null,"F4 – 128",{"$f":"'B120-Processing sheet'!F159","v":0},null,{"$f":"'B120-Processing sheet'!G159","v":0}]
[null,null,{"$f":"IF('B120-Processing sheet'!F159=\"\",\"\",\"LIST\")","v":""}]
[null,"F5 – 129",{"$f":"'B120-Processing sheet'!F161","v":"Council records indicate the presence of other properties (businesses) within this complex which are likely to continue operating during the construction of the addition. Please provide details of barriers that will be provided to protect the public and restrict access sufficient to demonstrate compliance with the requirements of F5.\n\n13/07/17 - thank you for the response, however there is insufficient information to demonstrate protection of the public during works. Please show on drawings the presence of barrier fencing sufficient to prevent public access to site during construction."},null,{"$f":"'B120-Processing sheet'!$G$161","v":"Resolved"}]
[null,null,{"$f":"IF('B120-Processing sheet'!F161=\"\",\"\",\"LIST\")","v":"LIST"}]
[null,"F6 – 130",{"$f":"'B120-Processing sheet'!F163","v":0},null,{"$f":"'B120-Processing sheet'!$G$163","v":0}]
[null,null,{"$f":"IF('B120-Processing sheet'!F163=\"\",\"\",\"LIST\")","v":""}]
[null,"F7 – 131",{"$f":"'B120-Processing sheet'!F165","v":0},null,{"$f":"'B120-Processing sheet'!$G$165","v":0}]
[null,null,{"$f":"IF('B120-Processing sheet'!F165=\"\",\"\",\"LIST\")","v":""}]
[null,"F8 – 132",{"$f":"'B120-Processing sheet'!F167","v":0},null,{"$f":"'B120-Processing sheet'!G167","v":0}]
[null,null,{"$f":"IF('B120-Processing sheet'!F167=\"\",\"\",\"LIST\")","v":""}]
[null,"F8 – 133",{"$f":"'B120-Processing sheet'!F168","v":0},null,{"$f":"'B120-Processing sheet'!G168","v":0}]
[null,null,{"$f":"IF('B120-Processing sheet'!F168=\"\",\"\",\"LIST\")","v":""}]
[null,"F8 – 134",{"$f":"'B120-Processing sheet'!F169","v":0},null,{"$f":"'B120-Processing sheet'!G169","v":0}]
[null,null,{"$f":"IF('B120-Processing sheet'!F169=\"\",\"\",\"LIST\")","v":""}]
[null,"G1 – 135",{"$f":"'B120-Processing sheet'!F171","v":0},null,{"$f":"'B120-Processing sheet'!G171","v":0}]
[null,null,{"$f":"IF('B120-Processing sheet'!F171=\"\",\"\",\"LIST\")","v":""}]
[null,"G1 – 136",{"$f":"'B120-Processing sheet'!F172","v":0},null,{"$f":"'B120-Processing sheet'!G172","v":0}]
[null,null,{"$f":"IF('B120-Processing sheet'!F172=\"\",\"\",\"LIST\")","v":""}]
[null,"G1 – 137",{"$f":"'B120-Processing sheet'!F173","v":0},null,{"$f":"'B120-Processing sheet'!G173","v":0}]
[null,null,{"$f":"IF('B120-Processing sheet'!F173=\"\",\"\",\"LIST\")","v":""}]
[null,"G1 – 138",{"$f":"'B120-Processing sheet'!F174","v":0},null,{"$f":"'B120-Processing sheet'!G174","v":0}]
[null,null,{"$f":"IF('B120-Processing sheet'!F174=\"\",\"\",\"LIST\")","v":""}]
[null,"G2 – 139",{"$f":"'B120-Processing sheet'!F176","v":0},null,{"$f":"'B120-Processing sheet'!$G$176","v":0}]
[null,null,{"$f":"IF('B120-Processing sheet'!F176=\"\",\"\",\"LIST\")","v":""}]
[null,"G3 – 140",{"$f":"'B120-Processing sheet'!F178","v":0},null,{"$f":"'B120-Processing sheet'!G178","v":0}]
[null,null,{"$f":"IF('B120-Processing sheet'!F178=\"\",\"\",\"LIST\")","v":""}]
[null,"G3 – 141",{"$f":"'B120-Processing sheet'!F179","v":0},null,{"$f":"'B120-Processing sheet'!G179","v":0}]
[null,null,{"$f":"IF('B120-Processing sheet'!F179=\"\",\"\",\"LIST\")","v":""}]
[null,"G3 – 142",{"$f":"'B120-Processing sheet'!F180","v":0},null,{"$f":"'B120-Processing sheet'!G180","v":0}]
[null,null,{"$f":"IF('B120-Processing sheet'!F180=\"\",\"\",\"LIST\")","v":""}]
[null,"G3 – 143",{"$f":"'B120-Processing sheet'!F181","v":0},null,{"$f":"'B120-Processing sheet'!G181","v":0}]
[null,null,{"$f":"IF('B120-Processing sheet'!F181=\"\",\"\",\"LIST\")","v":""}]
[null,"G3 – 144",{"$f":"'B120-Processing sheet'!F182","v":0},null,{"$f":"'B120-Processing sheet'!G182","v":0}]
[null,null,{"$f":"IF('B120-Processing sheet'!F182=\"\",\"\",\"LIST\")","v":""}]
[null,"G4 – 145",{"$f":"'B120-Processing sheet'!F184","v":0},null,{"$f":"'B120-Processing sheet'!G184","v":0}]
[null,null,{"$f":"IF('B120-Processing sheet'!F184=\"\",\"\",\"LIST\")","v":""}]
[null,"G4 – 146",{"$f":"'B120-Processing sheet'!F185","v":0},null,{"$f":"'B120-Processing sheet'!G185","v":0}]
[null,null,{"$f":"IF('B120-Processing sheet'!F185=\"\",\"\",\"LIST\")","v":""}]
[null,"G4 – 147",{"$f":"'B120-Processing sheet'!F186","v":0},null,{"$f":"'B120-Processing sheet'!G186","v":0}]
[null,null,{"$f":"IF('B120-Processing sheet'!F186=\"\",\"\",\"LIST\")","v":""}]
[null,"G4 – 148",{"$f":"'B120-Processing sheet'!F187","v":0},null,{"$f":"'B120-Processing sheet'!G187","v":0}]
[null,null,{"$f":"IF('B120-Processing sheet'!F187=\"\",\"\",\"LIST\")","v":""}]
[null,"G4 – 149",{"$f":"'B120-Processing sheet'!F188","v":0},null,{"$f":"'B120-Processing sheet'!G188","v":0}]
[null,null,{"$f":"IF('B120-Processing sheet'!F188=\"\",\"\",\"LIST\")","v":""}]
[null,"G5 – 150",{"$f":"'B120-Processing sheet'!F190","v":0},null,{"$f":"'B120-Processing sheet'!G190","v":0}]
[null,null,{"$f":"IF('B120-Processing sheet'!F190=\"\",\"\",\"LIST\")","v":""}]
[null,"G5 – 151",{"$f":"'B120-Processing sheet'!F191","v":0},null,{"$f":"'B120-Processing sheet'!G191","v":0}]
[null,null,{"$f":"IF('B120-Processing sheet'!F191=\"\",\"\",\"LIST\")","v":""}]
[null,"G5 – 152",{"$f":"'B120-Processing sheet'!F192","v":0},null,{"$f":"'B120-Processing sheet'!G192","v":0}]
[null,null,{"$f":"IF('B120-Processing sheet'!F192=\"\",\"\",\"LIST\")","v":""}]
[null,"G6 – 153",{"$f":"'B120-Processing sheet'!F194","v":0},null,{"$f":"'B120-Processing sheet'!G194","v":0}]
[null,null,{"$f":"IF('B120-Processing sheet'!F194=\"\",\"\",\"LIST\")","v":""}]
[null,"G6 – 154",{"$f":"'B120-Processing sheet'!F195","v":0},null,{"$f":"'B120-Processing sheet'!G195","v":0}]
[null,null,{"$f":"IF('B120-Processing sheet'!F195=\"\",\"\",\"LIST\")","v":""}]
[null,"G7 – 155",{"$f":"'B120-Processing sheet'!F197","v":0},null,{"$f":"'B120-Processing sheet'!G197","v":0}]
[null,null,{"$f":"IF('B120-Processing sheet'!F197=\"\",\"\",\"LIST\")","v":""}]
[null,"G7 – 156",{"$f":"'B120-Processing sheet'!F198","v":0},null,{"$f":"'B120-Processing sheet'!G198","v":0}]
[null,null,{"$f":"IF('B120-Processing sheet'!F198=\"\",\"\",\"LIST\")","v":""}]
[null,"G8 – 157",{"$f":"'B120-Processing sheet'!F200","v":0},null,{"$f":"'B120-Processing sheet'!G200","v":0}]
[null,null,{"$f":"IF('B120-Processing sheet'!F200=\"\",\"\",\"LIST\")","v":""}]
[null,"G9 – 158",{"$f":"'B120-Processing sheet'!F202","v":0},null,{"$f":"'B120-Processing sheet'!G202","v":0}]
[null,null,{"$f":"IF('B120-Processing sheet'!F202=\"\",\"\",\"LIST\")","v":""}]
[null,"G9 – 159",{"$f":"'B120-Processing sheet'!F203","v":0},null,{"$f":"'B120-Processing sheet'!G203","v":0}]
[null,null,{"$f":"IF('B120-Processing sheet'!F203=\"\",\"\",\"LIST\")","v":""}]
[null,"G9 – 160",{"$f":"'B120-Processing sheet'!F204","v":0},null,{"$f":"'B120-Processing sheet'!G204","v":0}]
[null,null,{"$f":"IF('B120-Processing sheet'!F204=\"\",\"\",\"LIST\")","v":""}]
[null,"G10 - 161",{"$f":"'B120-Processing sheet'!F206","v":0},null,{"$f":"'B120-Processing sheet'!G206","v":0}]
[null,null,{"$f":"IF('B120-Processing sheet'!F206=\"\",\"\",\"LIST\")","v":""}]
[null,"G10 - 162",{"$f":"'B120-Processing sheet'!F207","v":"Please revise the standard referenced on sheet A8 in relation to the gas supply. The current standard for gas installation is AS/NZS5601:2013."},null,{"$f":"'B120-Processing sheet'!G207","v":"Resolved"}]
[null,null,{"$f":"IF('B120-Processing sheet'!F207=\"\",\"\",\"LIST\")","v":"LIST"}]
[null,"G12 – 163",{"$f":"'B120-Processing sheet'!F209","v":0},null,{"$f":"'B120-Processing sheet'!G209","v":0}]
[null,null,{"$f":"IF('B120-Processing sheet'!F209=\"\",\"\",\"LIST\")","v":""}]
[null,"G12 – 164",{"$f":"'B120-Processing sheet'!F210","v":0},null,{"$f":"'B120-Processing sheet'!G210","v":0}]
[null,null,{"$f":"IF('B120-Processing sheet'!F210=\"\",\"\",\"LIST\")","v":""}]
[null,"G12 – 165",{"$f":"'B120-Processing sheet'!F211","v":"Council records show this property to be industrial, however there are no records indicating the presence of backflow prevention device. The Council waters department requires all commercial properties to have a backflow prevention device at the boundary to protect the network water supply. Installation of the backflow preventor requires a building consent. Please advise if you would like to increase to scope to include the installation of a backflow prevention device, if so all supporting documentation identifying type and model will also be required."},null,{"$f":"'B120-Processing sheet'!G211","v":"Resolved"}]
[null,null,{"$f":"IF('B120-Processing sheet'!F211=\"\",\"\",\"LIST\")","v":"LIST"}]
[null,"G12 – 166",{"$f":"'B120-Processing sheet'!F212","v":0},null,{"$f":"'B120-Processing sheet'!G212","v":0}]
[null,null,{"$f":"IF('B120-Processing sheet'!F212=\"\",\"\",\"LIST\")","v":""}]
[null,"G12 – 167",{"$f":"'B120-Processing sheet'!F213","v":0},null,{"$f":"'B120-Processing sheet'!G213","v":0}]
[null,null,{"$f":"IF('B120-Processing sheet'!F213=\"\",\"\",\"LIST\")","v":""}]
[null,"G12 – 168",{"$f":"'B120-Processing sheet'!F214","v":0},null,{"$f":"'B120-Processing sheet'!G214","v":0}]
[null,null,{"$f":"IF('B120-Processing sheet'!F214=\"\",\"\",\"LIST\")","v":""}]
[null,"G12 – 169",{"$f":"'B120-Processing sheet'!F215","v":0},null,{"$f":"'B120-Processing sheet'!G215","v":0}]
[null,null,{"$f":"IF('B120-Processing sheet'!F215=\"\",\"\",\"LIST\")","v":""}]
[null,"G13 – 170",{"$f":"'B120-Processing sheet'!F217","v":"Please review the plumbing design taking into consideration that AS3500 requires all drains within slabs to be minimum of 65mm diameter."},null,{"$f":"'B120-Processing sheet'!G217","v":"Resolved"}]
[null,null,{"$f":"IF('B120-Processing sheet'!F217=\"\",\"\",\"LIST\")","v":"LIST"}]
[null,"G13 – 171",{"$f":"'B120-Processing sheet'!F218","v":"1. The plumbing plan indicates the presence of two existing inspection bends (IB) for the existing sewer pipe. Please review the requirement and if necessary provide sufficient details to demonstrate that these can be maintained to demonstrate compliance with the requirements of AS3500.\n\n2. Please review the location of inspection points for the existing wastewater connection - note at least one required outside the edge of building."},null,{"$f":"'B120-Processing sheet'!G218","v":"Resolved"}]
[null,null,{"$f":"IF('B120-Processing sheet'!F218=\"\",\"\",\"LIST\")","v":"LIST"}]
[null,"G13 – 172",{"$f":"'B120-Processing sheet'!F219","v":"Please provide sufficient information to demonstrate compliance with the requirements of AS3500 in relation to implications of trenches close to building and drains under buildings."},null,{"$f":"'B120-Processing sheet'!G219","v":"Resolved"}]
[null,null,{"$f":"IF('B120-Processing sheet'!F219=\"\",\"\",\"LIST\")","v":"LIST"}]
[null,"G13 – 173",{"$f":"'B120-Processing sheet'!F220","v":0},null,{"$f":"'B120-Processing sheet'!G220","v":0}]
[null,null,{"$f":"IF('B120-Processing sheet'!F220=\"\",\"\",\"LIST\")","v":""}]
[null,"G13 – 174",{"$f":"'B120-Processing sheet'!F221","v":0},null,{"$f":"'B120-Processing sheet'!G221","v":0}]
[null,null,{"$f":"IF('B120-Processing sheet'!F221=\"\",\"\",\"LIST\")","v":""}]
[null,"G13 – 175",{"$f":"'B120-Processing sheet'!F222","v":0},null,{"$f":"'B120-Processing sheet'!G222","v":0}]
[null,null,{"$f":"IF('B120-Processing sheet'!F222=\"\",\"\",\"LIST\")","v":""}]
[null,"G13 – 176",{"$f":"'B120-Processing sheet'!F223","v":0},null,{"$f":"'B120-Processing sheet'!G223","v":0}]
[null,null,{"$f":"IF('B120-Processing sheet'!F223=\"\",\"\",\"LIST\")","v":""}]
[null,"G14 – 177",{"$f":"'B120-Processing sheet'!F225","v":0},null,{"$f":"'B120-Processing sheet'!G225","v":0}]
[null,null,{"$f":"IF('B120-Processing sheet'!F225=\"\",\"\",\"LIST\")","v":""}]
[null,"G15 – 178",{"$f":"'B120-Processing sheet'!F227","v":0},null,{"$f":"'B120-Processing sheet'!G227","v":0}]
[null,null,{"$f":"IF('B120-Processing sheet'!F227=\"\",\"\",\"LIST\")","v":""}]
[null,"H1 – 179",{"$f":"'B120-Processing sheet'!F229","v":0},null,{"$f":"'B120-Processing sheet'!G229","v":0}]
[null,null,{"$f":"IF('B120-Processing sheet'!F229=\"\",\"\",\"LIST\")","v":""}]
[null,"H1 – 180",{"$f":"'B120-Processing sheet'!F230","v":"1. Please provide details of the extent of conditioned space for the new addition taking into consideration the opening between the new and existing building sufficient to demonstrate compliance with the requirements of H1.\n\n2. Please review the H1 calculations provided. The reference heat loss for the vertical glazing appears excessive in relation to the proposed vertical glazing."},null,{"$f":"'B120-Processing sheet'!G230","v":"Resolved"}]
[null,null,{"$f":"IF('B120-Processing sheet'!F230=\"\",\"\",\"LIST\")","v":"LIST"}]
[null,"H1 – 181",{"$f":"'B120-Processing sheet'!F231","v":0},null,{"$f":"'B120-Processing sheet'!G231","v":0}]
[null,null,{"$f":"IF('B120-Processing sheet'!F231=\"\",\"\",\"LIST\")","v":""}]
[null,"H1 – 182",{"$f":"'B120-Processing sheet'!F232","v":0},null,{"$f":"'B120-Processing sheet'!G232","v":0}]
[null,null,{"$f":"IF('B120-Processing sheet'!F232=\"\",\"\",\"LIST\")","v":""}]
[null,"CS - 183",{"$f":"'B120-Processing sheet'!F234","v":0},null,{"$f":"'B120-Processing sheet'!G234","v":0}]
[null,null,{"$f":"IF('B120-Processing sheet'!F234=\"\",\"\",\"LIST\")","v":""}]
[null,"CS  - 184",{"$f":"'B120-Processing sheet'!F235","v":0},null,{"$f":"'B120-Processing sheet'!G235","v":0}]
[null,null,{"$f":"IF('B120-Processing sheet'!F235=\"\",\"\",\"LIST\")","v":""}]
[null,"CM - 185",{"$f":"'B120-Processing sheet'!F237","v":0},null,{"$f":"'B120-Processing sheet'!G237","v":0}]
[null,null,{"$f":"IF('B120-Processing sheet'!F237=\"\",\"\",\"LIST\")","v":""}]
[null,"CM - 186",{"$f":"'B120-Processing sheet'!F238","v":0},null,{"$f":"'B120-Processing sheet'!G238","v":0}]
[null,null,{"$f":"IF('B120-Processing sheet'!F238=\"\",\"\",\"LIST\")","v":""}]
[null,"OT - 187",{"$f":"'B120-Processing sheet'!F240","v":0},null,{"$f":"'B120-Processing sheet'!G240","v":0}]
[null,null,{"$f":"IF('B120-Processing sheet'!F240=\"\",\"\",\"LIST\")","v":""}]
[null,"OT - 188",{"$f":"'B120-Processing sheet'!F241","v":0},null,{"$f":"'B120-Processing sheet'!G241","v":0}]
[null,null,{"$f":"IF('B120-Processing sheet'!F241=\"\",\"\",\"LIST\")","v":""}]
[null,"HAZ - 001",{"$f":"'S71-74 natural hazards'!$F$18","v":0},null,{"$f":"'S71-74 natural hazards'!$G$18","v":0}]
[null,null,{"$f":"IF('S71-74 natural hazards'!F18=\"\",\"\",\"LIST\")","v":""}]
[null,"HAZ - 002",{"$f":"'S71-74 natural hazards'!$F$19","v":0},null,{"$f":"'S71-74 natural hazards'!$G$19","v":0}]
[null,null,{"$f":"IF('S71-74 natural hazards'!F19=\"\",\"\",\"LIST\")","v":""}]
[null,"HAZ - 003",{"$f":"'S71-74 natural hazards'!$F$20","v":0},null,{"$f":"'S71-74 natural hazards'!$G$20","v":0}]
[null,null,{"$f":"IF('S71-74 natural hazards'!F20=\"\",\"\",\"LIST\")","v":""}]
[null,"HAZ - 004",{"$f":"'S71-74 natural hazards'!$F$21","v":0},null,{"$f":"'S71-74 natural hazards'!$G$21","v":0}]
[null,null,{"$f":"IF('S71-74 natural hazards'!F21=\"\",\"\",\"LIST\")","v":""}]
[null,"HAZ - 005",{"$f":"'S71-74 natural hazards'!$F$22","v":0},null,{"$f":"'S71-74 natural hazards'!$G$22","v":0}]
[null,null,{"$f":"IF('S71-74 natural hazards'!F22=\"\",\"\",\"LIST\")","v":""}]
[null,"HAZ - 006",{"$f":"'S71-74 natural hazards'!$F$23","v":0},null,{"$f":"'S71-74 natural hazards'!$G$23","v":0}]
[null,null,{"$f":"IF('S71-74 natural hazards'!F23=\"\",\"\",\"LIST\")","v":""}]
[null,"HAZ - 007",{"$f":"'S71-74 natural hazards'!$F$24","v":0},null,{"$f":"'S71-74 natural hazards'!$G$24","v":0}]
[null,null,{"$f":"IF('S71-74 natural hazards'!F24=\"\",\"\",\"LIST\")","v":""}]
[null,"HAZ - 008",{"$f":"'S71-74 natural hazards'!$F$25","v":0},null,{"$f":"'S71-74 natural hazards'!$G$25","v":0}]
[null,null,{"$f":"IF('S71-74 natural hazards'!F25=\"\",\"\",\"LIST\")","v":""}]
[null,"HAZ - 009",{"$f":"'S71-74 natural hazards'!$F$26","v":0},null,{"$f":"'S71-74 natural hazards'!$G$26","v":0}]
[null,null,{"$f":"IF('S71-74 natural hazards'!F26=\"\",\"\",\"LIST\")","v":""}]
[null,"HAZ - 010",{"$f":"'S71-74 natural hazards'!$F$27","v":0},null,{"$f":"'S71-74 natural hazards'!$G$27","v":0}]
[null,null,{"$f":"IF('S71-74 natural hazards'!F27=\"\",\"\",\"LIST\")","v":""}]
[null,null,{"$f":"IF('B150-Structural specialist '!K24>1,'B150-Structural specialist '!L28,\"\")","v":"Specialist Review : Geotechnical  (Margaret Stoffel)"}]
[null,"GEO - 001",{"$f":"'B150-Structural specialist '!F22","v":"a) please provide Engco geotechnical report for 83 Byron St. ADDED 13/7/17 report not provided; please provide ENGCO report. ADDED 31/7/17: Please provide results of CPT and CPTu site investigation. RESOLVED 15/8/17\n\na2) ADDED 31/7/17: The Engco report for 83 Byron St indicates potential liquefaction induced settlement up to 100mm for SLS and up to 165mm for ULS are possible. Please clarify that this has been considered in design of the slab footing for 80 Byron St extension. 15/8/17: WITHDRAWN\n\nb) Please compare foundation for existing building to the foundation for the proposed extension since the two will be structurally connected. WITHDRAWN  13/7/17\n\nc) Specification section 2.4.1 Excavation states: “Below slabs on ground the general intent is to excavate to a stable undisturbed subgrade (of 300kPa ultimate bearing capacity).” This is inconsistent with the PS1 and the geotechnical letter which indicate the foundation was designed for a safe bearing of 50kPa (which I understand to be equivalent to an ultimate bearing capacity of 150kPa which was recommended by the geotechnical letter). Please amend specification. RESOLVED 13/7/2013\n\nd) Specification section 2.4.1 Excavation also states “As soon as excavation and filling is complete foundation material will be inspected by the Architect…”. Please amend specification for foundation subgrade to be verified by the geotechnical engineer. RESOLVED 13/7/2013\n\ne) Specification section 2.4.2 Hardfill & Blinding states “Hardfill under slabs on grade shall be 150mm of standard TNZ AP40 basecourse…”  The geotechnical letter recommends a 300mm thick layer of AP65 below the concrete slab if placed on organic fill with UBC 150kPa, with geotextile (Bidim A19 or equal) on base & sides of excavation, geogrid (Cirtex Duragrid 30/30 or equal) over the textile; extending beyond the building footprint a distance equal to the depth of the gravel. Please address why geotechnical recommendations were not followed. RESOLVED 13/7/2013\n\n"},null,{"$f":"'B150-Structural specialist '!G22","v":"RESOLVED"}]
[null,null,{"$f":"IF('B150-Structural specialist '!F22=\"\",\"\",\"LIST\")","v":"LIST"}]
[null,"GEO - 001A",{"$f":"'B150-Structural specialist '!F23","v":"f) The geotechnical letter also recommends that where it is not possible to extend the gravel layer beyond the building footprint on the South & West sides of the building because the site boundary does not does not provide adequate space, a new slab section must be designed. Please address this issue. ADDED 13/7/17: Response revers to structural calculations; this does not answer the question. Please indicate where this information is found. 31/7/17: no response provided RESOLVED 15/8/17"},null,{"$f":"'B150-Structural specialist '!G23","v":0}]
[null,null,{"$f":"IF('B150-Structural specialist '!F23=\"\",\"\",\"LIST\")","v":"LIST"}]
[null,null,{"$f":"IF('B150-Structural specialist '!K39>1,'B150-Structural specialist '!M33,\"\")","v":""}]
[null,"STR -002",{"$f":"'B150-Structural specialist '!F25","v":0},null,{"$f":"'B150-Structural specialist '!G25","v":0}]
[null,null,{"$f":"IF('B150-Structural specialist '!F25=\"\",\"\",\"LIST\")","v":""}]
[null,"STR -003",{"$f":"'B150-Structural specialist '!F26","v":0},null,{"$f":"'B150-Structural specialist '!G26","v":0}]
[null,null,{"$f":"IF('B150-Structural specialist '!F26=\"\",\"\",\"LIST\")","v":""}]
[null,"STR -004",{"$f":"'B150-Structural specialist '!F27","v":0},null,{"$f":"'B150-Structural specialist '!G27","v":0}]
[null,null,{"$f":"IF('B150-Structural specialist '!F27=\"\",\"\",\"LIST\")","v":""}]
[null,"STR -005",{"$f":"'B150-Structural specialist '!F29","v":0},null,{"$f":"'B150-Structural specialist '!G29","v":0}]
[null,null,{"$f":"IF('B150-Structural specialist '!F29=\"\",\"\",\"LIST\")","v":""}]
[null,"STR -006",{"$f":"'B150-Structural specialist '!F31","v":0},null,{"$f":"'B150-Structural specialist '!G31","v":0}]
[null,null,{"$f":"IF('B150-Structural specialist '!F31=\"\",\"\",\"LIST\")","v":""}]
[null,"STR -007",{"$f":"'B150-Structural specialist '!F32","v":0},null,{"$f":"'B150-Structural specialist '!G32","v":0}]
[null,null,{"$f":"IF('B150-Structural specialist '!F32=\"\",\"\",\"LIST\")","v":""}]
[null,"STR -008",{"$f":"'B150-Structural specialist '!F33","v":0},null,{"$f":"'B150-Structural specialist '!G33","v":0}]
[null,null,{"$f":"IF('B150-Structural specialist '!F33=\"\",\"\",\"LIST\")","v":""}]
[null,"STR -009",{"$f":"'B150-Structural specialist '!F34","v":0},null,{"$f":"'B150-Structural specialist '!G34","v":0}]
[null,null,{"$f":"IF('B150-Structural specialist '!F34=\"\",\"\",\"LIST\")","v":""}]
[null,"STR -010",{"$f":"'B150-Structural specialist '!F36","v":0},null,{"$f":"'B150-Structural specialist '!G36","v":0}]
[null,null,{"$f":"IF('B150-Structural specialist '!F36=\"\",\"\",\"LIST\")","v":""}]
[null,"STR -010A",{"$f":"'B150-Structural specialist '!F37","v":0},null,{"$f":"'B150-Structural specialist '!G37","v":0}]
[null,null,{"$f":"IF('B150-Structural specialist '!F37=\"\",\"\",\"LIST\")","v":""}]
[null,null,{"$f":"IF('B151a-Fire safety specialist'!K72>1,'B151a-Fire safety specialist'!M70,\"\")","v":"Specialist Review : Fire  (Adrienne Slattery (Jonathan Nyman from 13/7/2017))"}]
[null,"FIR - 001",{"$f":"'B151a-Fire safety specialist'!F15","v":0},null,{"$f":"'B151a-Fire safety specialist'!G15","v":0}]
[null,null,{"$f":"IF('B151a-Fire safety specialist'!F15=\"\",\"\",\"LIST\")","v":""}]
[null,"FIR - 002",{"$f":"'B151a-Fire safety specialist'!F16","v":0},null,{"$f":"'B151a-Fire safety specialist'!G16","v":0}]
[null,null,{"$f":"IF('B151a-Fire safety specialist'!F16=\"\",\"\",\"LIST\")","v":""}]
[null,"FIR - 003",{"$f":"'B151a-Fire safety specialist'!F18","v":0},null,{"$f":"'B151a-Fire safety specialist'!G18","v":0}]
[null,null,{"$f":"IF('B151a-Fire safety specialist'!F18=\"\",\"\",\"LIST\")","v":""}]
[null,"FIR - 004",{"$f":"'B151a-Fire safety specialist'!F19","v":0},null,{"$f":"'B151a-Fire safety specialist'!G19","v":0}]
[null,null,{"$f":"IF('B151a-Fire safety specialist'!F19=\"\",\"\",\"LIST\")","v":""}]
[null,"FIR - 005",{"$f":"'B151a-Fire safety specialist'!F20","v":"The existing use listed on the compliance schedule is WL FHC2 and the building in part is provided with sprinkler coverage. Please reassess the building and update the fire report to reflect the change of use occuring and specified systems within the building. We cannot amend the compliance schedule without further information provided on the sprinkler system. \nADDED 13/7/2017 - Response noted.  As previously advised the existing Compliance Schedule (CS) states the building Purpose Group as WL, and that the building has some form of sprinkler protection.  The fire design proposes the building is to be used for workshop with storage to 3m which would change the use to WM Purpose Group. Consideration of such a Change of Use, and any building deletion of sprinklers from the CS and it's impact on neighbouring property protection as applicable is required."},null,{"$f":"'B151a-Fire safety specialist'!G20","v":"Resolved"}]
[null,null,{"$f":"IF('B151a-Fire safety specialist'!F20=\"\",\"\",\"LIST\")","v":"LIST"}]
[null,"FIR - 006",{"$f":"'B151a-Fire safety specialist'!F21","v":0},null,{"$f":"'B151a-Fire safety specialist'!G21","v":0}]
[null,null,{"$f":"IF('B151a-Fire safety specialist'!F21=\"\",\"\",\"LIST\")","v":""}]
[null,"FIR - 007",{"$f":"'B151a-Fire safety specialist'!F22","v":0},null,{"$f":"'B151a-Fire safety specialist'!G22","v":0}]
[null,null,{"$f":"IF('B151a-Fire safety specialist'!F22=\"\",\"\",\"LIST\")","v":""}]
[null,"FIR - 008",{"$f":"'B151a-Fire safety specialist'!F23","v":0},null,{"$f":"'B151a-Fire safety specialist'!G23","v":0}]
[null,null,{"$f":"IF('B151a-Fire safety specialist'!F23=\"\",\"\",\"LIST\")","v":""}]
[null,"FIR - 009",{"$f":"'B151a-Fire safety specialist'!F24","v":0},null,{"$f":"'B151a-Fire safety specialist'!G24","v":0}]
[null,null,{"$f":"IF('B151a-Fire safety specialist'!F24=\"\",\"\",\"LIST\")","v":""}]
[null,"FIR - 010",{"$f":"'B151a-Fire safety specialist'!F25","v":"As this application meets the criteria in NEW ZEALAND GAZETTE, No. 49  under 'Notice that Copies of Certain Applications for Building Consent Must be Provided to the New Zealand Fire Service Commission', the application has been sent to NZFS for them to provide a memorandum in accordance with section 47 of the Building Act. Once we receive their memorandum we will give regard to the memorandum and send to you for your response.\nADDED 21/04/2017 Please address the issues raised in the attached memo from the NZFS. \nADDED 13/7/2017 - Response to NZFS DRU memo, issued 21/4/2017, is still awaited. Memo is re-attached for use."},null,{"$f":"'B151a-Fire safety specialist'!G25","v":"Resolved"}]
[null,null,{"$f":"IF('B151a-Fire safety specialist'!F25=\"\",\"\",\"LIST\")","v":"LIST"}]
[null,"FIR - 011",{"$f":"'B151a-Fire safety specialist'!F26","v":0},null,{"$f":"'B151a-Fire safety specialist'!G26","v":0}]
[null,null,{"$f":"IF('B151a-Fire safety specialist'!F26=\"\",\"\",\"LIST\")","v":""}]
[null,"FIR - 012",{"$f":"'B151a-Fire safety specialist'!F28","v":0},null,{"$f":"'B151a-Fire safety specialist'!G28","v":0}]
[null,null,{"$f":"IF('B151a-Fire safety specialist'!F28=\"\",\"\",\"LIST\")","v":""}]
[null,"FIR - 013",{"$f":"'B151a-Fire safety specialist'!F29","v":0},null,{"$f":"'B151a-Fire safety specialist'!G29","v":0}]
[null,null,{"$f":"IF('B151a-Fire safety specialist'!F29=\"\",\"\",\"LIST\")","v":""}]
[null,"FIR - 014",{"$f":"'B151a-Fire safety specialist'!F30","v":0},null,{"$f":"'B151a-Fire safety specialist'!G30","v":0}]
[null,null,{"$f":"IF('B151a-Fire safety specialist'!F30=\"\",\"\",\"LIST\")","v":""}]
[null,"FIR - 015",{"$f":"'B151a-Fire safety specialist'!F31","v":0},null,{"$f":"'B151a-Fire safety specialist'!G31","v":0}]
[null,null,{"$f":"IF('B151a-Fire safety specialist'!F31=\"\",\"\",\"LIST\")","v":""}]
[null,"FIR - 016",{"$f":"'B151a-Fire safety specialist'!F32","v":0},null,{"$f":"'B151a-Fire safety specialist'!G32","v":0}]
[null,null,{"$f":"IF('B151a-Fire safety specialist'!F32=\"\",\"\",\"LIST\")","v":""}]
[null,"FIR - 017",{"$f":"'B151a-Fire safety specialist'!F33","v":0},null,{"$f":"'B151a-Fire safety specialist'!G33","v":0}]
[null,null,{"$f":"IF('B151a-Fire safety specialist'!F33=\"\",\"\",\"LIST\")","v":""}]
[null,"FIR - 018",{"$f":"'B151a-Fire safety specialist'!F34","v":0},null,{"$f":"'B151a-Fire safety specialist'!G34","v":0}]
[null,null,{"$f":"IF('B151a-Fire safety specialist'!F34=\"\",\"\",\"LIST\")","v":""}]
[null,"FIR - 019",{"$f":"'B151a-Fire safety specialist'!F35","v":0},null,{"$f":"'B151a-Fire safety specialist'!G35","v":0}]
[null,null,{"$f":"IF('B151a-Fire safety specialist'!F35=\"\",\"\",\"LIST\")","v":""}]
[null,"FIR - 020",{"$f":"'B151a-Fire safety specialist'!F36","v":0},null,{"$f":"'B151a-Fire safety specialist'!G36","v":0}]
[null,null,{"$f":"IF('B151a-Fire safety specialist'!F36=\"\",\"\",\"LIST\")","v":""}]
[null,"FIR - 021",{"$f":"'B151a-Fire safety specialist'!F37","v":0},null,{"$f":"'B151a-Fire safety specialist'!G37","v":0}]
[null,null,{"$f":"IF('B151a-Fire safety specialist'!F37=\"\",\"\",\"LIST\")","v":""}]
[null,"FIR - 022",{"$f":"'B151a-Fire safety specialist'!F38","v":0},null,{"$f":"'B151a-Fire safety specialist'!G38","v":0}]
[null,null,{"$f":"IF('B151a-Fire safety specialist'!F38=\"\",\"\",\"LIST\")","v":""}]
[null,"FIR - 023",{"$f":"'B151a-Fire safety specialist'!F39","v":0},null,{"$f":"'B151a-Fire safety specialist'!G39","v":0}]
[null,null,{"$f":"IF('B151a-Fire safety specialist'!F39=\"\",\"\",\"LIST\")","v":""}]
[null,"FIR - 024",{"$f":"'B151a-Fire safety specialist'!F41","v":0},null,{"$f":"'B151a-Fire safety specialist'!G41","v":0}]
[null,null,{"$f":"IF('B151a-Fire safety specialist'!F41=\"\",\"\",\"LIST\")","v":""}]
[null,"FIR - 025",{"$f":"'B151a-Fire safety specialist'!F42","v":"Please provide further justification for the occupant load density for the workshop area and please update the fire report."},null,{"$f":"'B151a-Fire safety specialist'!G42","v":"Resolved"}]
[null,null,{"$f":"IF('B151a-Fire safety specialist'!F42=\"\",\"\",\"LIST\")","v":"LIST"}]
[null,"FIR - 026",{"$f":"'B151a-Fire safety specialist'!F43","v":0},null,{"$f":"'B151a-Fire safety specialist'!G43","v":0}]
[null,null,{"$f":"IF('B151a-Fire safety specialist'!F43=\"\",\"\",\"LIST\")","v":""}]
[null,"FIR - 027",{"$f":"'B151a-Fire safety specialist'!F44","v":0},null,{"$f":"'B151a-Fire safety specialist'!G44","v":0}]
[null,null,{"$f":"IF('B151a-Fire safety specialist'!F44=\"\",\"\",\"LIST\")","v":""}]
[null,"FIR - 028",{"$f":"'B151a-Fire safety specialist'!F45","v":0},null,{"$f":"'B151a-Fire safety specialist'!G45","v":0}]
[null,null,{"$f":"IF('B151a-Fire safety specialist'!F45=\"\",\"\",\"LIST\")","v":""}]
[null,"FIR - 029",{"$f":"'B151a-Fire safety specialist'!F46","v":0},null,{"$f":"'B151a-Fire safety specialist'!G46","v":0}]
[null,null,{"$f":"IF('B151a-Fire safety specialist'!F46=\"\",\"\",\"LIST\")","v":""}]
[null,"FIR - 030",{"$f":"'B151a-Fire safety specialist'!F47","v":0},null,{"$f":"'B151a-Fire safety specialist'!G47","v":0}]
[null,null,{"$f":"IF('B151a-Fire safety specialist'!F47=\"\",\"\",\"LIST\")","v":""}]
[null,"FIR - 031",{"$f":"'B151a-Fire safety specialist'!F48","v":"The fire report requirements include replacing key locks with snib locks. To demonstrate that the design is coordinated please provide a door hardware schedule as part of the architectural set of drawings. \nADDED 13/7/2017 - Fire engineer response noted.  Please provide the door schedule detailing the required new door locks to be provided for compliance."},null,{"$f":"'B151a-Fire safety specialist'!G48","v":"Resolved"}]
[null,null,{"$f":"IF('B151a-Fire safety specialist'!F48=\"\",\"\",\"LIST\")","v":"LIST"}]
[null,"FIR - 032",{"$f":"'B151a-Fire safety specialist'!F49","v":0},null,{"$f":"'B151a-Fire safety specialist'!G49","v":0}]
[null,null,{"$f":"IF('B151a-Fire safety specialist'!F49=\"\",\"\",\"LIST\")","v":""}]
[null,"FIR - 033",{"$f":"'B151a-Fire safety specialist'!F50","v":0},null,{"$f":"'B151a-Fire safety specialist'!G50","v":0}]
[null,null,{"$f":"IF('B151a-Fire safety specialist'!F50=\"\",\"\",\"LIST\")","v":""}]
[null,"FIR - 034",{"$f":"'B151a-Fire safety specialist'!F51","v":0},null,{"$f":"'B151a-Fire safety specialist'!G51","v":0}]
[null,null,{"$f":"IF('B151a-Fire safety specialist'!F51=\"\",\"\",\"LIST\")","v":""}]
[null,"FIR - 035",{"$f":"'B151a-Fire safety specialist'!F52","v":0},null,{"$f":"'B151a-Fire safety specialist'!G52","v":0}]
[null,null,{"$f":"IF('B151a-Fire safety specialist'!F52=\"\",\"\",\"LIST\")","v":""}]
[null,"FIR - 036",{"$f":"'B151a-Fire safety specialist'!F53","v":0},null,{"$f":"'B151a-Fire safety specialist'!G53","v":0}]
[null,null,{"$f":"IF('B151a-Fire safety specialist'!F53=\"\",\"\",\"LIST\")","v":""}]
[null,"FIR - 037",{"$f":"'B151a-Fire safety specialist'!F54","v":"The fire report states that the wall and ceiling linings in the new office extension is painted plasterboard, however it appears that plywood is noted. Please update the fire report / architectural plans as applicable to demonstrate that the design has been coordinated. "},null,{"$f":"'B151a-Fire safety specialist'!G54","v":"Resolved"}]
[null,null,{"$f":"IF('B151a-Fire safety specialist'!F54=\"\",\"\",\"LIST\")","v":"LIST"}]
[null,"FIR - 038",{"$f":"'B151a-Fire safety specialist'!F55","v":0},null,{"$f":"'B151a-Fire safety specialist'!G55","v":0}]
[null,null,{"$f":"IF('B151a-Fire safety specialist'!F55=\"\",\"\",\"LIST\")","v":""}]
[null,"FIR - 039",{"$f":"'B151a-Fire safety specialist'!F56","v":0},null,{"$f":"'B151a-Fire safety specialist'!G56","v":0}]
[null,null,{"$f":"IF('B151a-Fire safety specialist'!F56=\"\",\"\",\"LIST\")","v":""}]
[null,"FIR - 040",{"$f":"'B151a-Fire safety specialist'!F57","v":0},null,{"$f":"'B151a-Fire safety specialist'!G57","v":0}]
[null,null,{"$f":"IF('B151a-Fire safety specialist'!F57=\"\",\"\",\"LIST\")","v":""}]
[null,"FIR - 041",{"$f":"'B151a-Fire safety specialist'!F59","v":0},null,{"$f":"'B151a-Fire safety specialist'!G59","v":0}]
[null,null,{"$f":"IF('B151a-Fire safety specialist'!F59=\"\",\"\",\"LIST\")","v":""}]
[null,"FIR - 042",{"$f":"'B151a-Fire safety specialist'!F60","v":0},null,{"$f":"'B151a-Fire safety specialist'!G60","v":0}]
[null,null,{"$f":"IF('B151a-Fire safety specialist'!F60=\"\",\"\",\"LIST\")","v":""}]
[null,"FIR - 043",{"$f":"'B151a-Fire safety specialist'!F61","v":0},null,{"$f":"'B151a-Fire safety specialist'!G61","v":0}]
[null,null,{"$f":"IF('B151a-Fire safety specialist'!F61=\"\",\"\",\"LIST\")","v":""}]
[null,"FIR - 044",{"$f":"'B151a-Fire safety specialist'!F62","v":"Please provide an emergency lighting design to demonstrate compliance with F6 of NZ Building Code as required in the Fire report. Please refer to paragraph 1.7 of F6/AS1 for the documentation you need to supply. Please provide full technical justification of the design and a PS1 from a CPEng engineer with assessed area being electrical engineering, or from a professional lighting consultant. \nADDED 13/7/2017 - Query outstanding"},null,{"$f":"'B151a-Fire safety specialist'!G62","v":"Resolved"}]
[null,null,{"$f":"IF('B151a-Fire safety specialist'!F62=\"\",\"\",\"LIST\")","v":"LIST"}]
[null,"FIR - 045",{"$f":"'B151a-Fire safety specialist'!F63","v":0},null,{"$f":"'B151a-Fire safety specialist'!G63","v":0}]
[null,null,{"$f":"IF('B151a-Fire safety specialist'!F63=\"\",\"\",\"LIST\")","v":""}]
[null,"FIR - 046",{"$f":"'B151a-Fire safety specialist'!F64","v":"We believe it is more appropriate for your emergency lighting designer to carry out the necessary inspections and provide a PS4 for the emergency lighting design at the completion of the project. Please confirm this is to be arranged.\nADDED 13/7/2017 - Query outstanding"},null,{"$f":"'B151a-Fire safety specialist'!G64","v":"Resolved"}]
[null,null,{"$f":"IF('B151a-Fire safety specialist'!F64=\"\",\"\",\"LIST\")","v":"LIST"}]
[null,"FIR - 047",{"$f":"'B151a-Fire safety specialist'!F65","v":0},null,{"$f":"'B151a-Fire safety specialist'!G65","v":0}]
[null,null,{"$f":"IF('B151a-Fire safety specialist'!F65=\"\",\"\",\"LIST\")","v":""}]
[null,"FIR - 048",{"$f":"'B151a-Fire safety specialist'!F67","v":0},null,{"$f":"'B151a-Fire safety specialist'!G67","v":0}]
[null,null,{"$f":"IF('B151a-Fire safety specialist'!F67=\"\",\"\",\"LIST\")","v":""}]
[null,"FIR - 049",{"$f":"'B151a-Fire safety specialist'!F68","v":0},null,{"$f":"'B151a-Fire safety specialist'!G68","v":0}]
[null,null,{"$f":"IF('B151a-Fire safety specialist'!F68=\"\",\"\",\"LIST\")","v":""}]
[null,"FIR - 050",{"$f":"'B151a-Fire safety specialist'!F69","v":0},null,{"$f":"'B151a-Fire safety specialist'!G69","v":0}]
[null,null,{"$f":"IF('B151a-Fire safety specialist'!F69=\"\",\"\",\"LIST\")","v":""}]
[null,"FIR - 051",{"$f":"'B151a-Fire safety specialist'!F70","v":0},null,{"$f":"'B151a-Fire safety specialist'!G70","v":0}]
[null,null,{"$f":"IF('B151a-Fire safety specialist'!F70=\"\",\"\",\"LIST\")","v":""}]
[null,"FIR - 052",{"$f":"'B151a-Fire safety specialist'!F71","v":0},null,{"$f":"'B151a-Fire safety specialist'!G71","v":0}]
[null,null,{"$f":"IF('B151a-Fire safety specialist'!F71=\"\",\"\",\"LIST\")","v":""}]
[null,null,{"$f":"IF('B151b-Fire safety specialist'!K40>1,'B151b-Fire safety specialist'!O38,\"\")","v":""}]
[null,"DPF - 001",{"$f":"'B151b-Fire safety specialist'!F22","v":0},null,{"$f":"'B151b-Fire safety specialist'!G22","v":0}]
[null,null,{"$f":"IF('B151b-Fire safety specialist'!F22=\"\",\"\",\"LIST\")","v":""}]
[null,"DPF - 002",{"$f":"'B151b-Fire safety specialist'!F23","v":0},null,{"$f":"'B151b-Fire safety specialist'!G23","v":0}]
[null,null,{"$f":"IF('B151b-Fire safety specialist'!F23=\"\",\"\",\"LIST\")","v":""}]
[null,"DPF - 003",{"$f":"'B151b-Fire safety specialist'!F25","v":0},null,{"$f":"'B151b-Fire safety specialist'!G25","v":0}]
[null,null,{"$f":"IF('B151b-Fire safety specialist'!F25=\"\",\"\",\"LIST\")","v":""}]
[null,"DPF - 004",{"$f":"'B151b-Fire safety specialist'!F27","v":0},null,{"$f":"'B151b-Fire safety specialist'!G27","v":0}]
[null,null,{"$f":"IF('B151b-Fire safety specialist'!F27=\"\",\"\",\"LIST\")","v":""}]
[null,"DPF - 005",{"$f":"'B151b-Fire safety specialist'!F28","v":0},null,{"$f":"'B151b-Fire safety specialist'!G28","v":0}]
[null,null,{"$f":"IF('B151b-Fire safety specialist'!F28=\"\",\"\",\"LIST\")","v":""}]
[null,"DPF - 006",{"$f":"'B151b-Fire safety specialist'!F29","v":0},null,{"$f":"'B151b-Fire safety specialist'!G29","v":0}]
[null,null,{"$f":"IF('B151b-Fire safety specialist'!F29=\"\",\"\",\"LIST\")","v":""}]
[null,"DPF - 007",{"$f":"'B151b-Fire safety specialist'!F30","v":0},null,{"$f":"'B151b-Fire safety specialist'!G30","v":0}]
[null,null,{"$f":"IF('B151b-Fire safety specialist'!F30=\"\",\"\",\"LIST\")","v":""}]
[null,"DPF - 008",{"$f":"'B151b-Fire safety specialist'!F31","v":0},null,{"$f":"'B151b-Fire safety specialist'!G31","v":0}]
[null,null,{"$f":"IF('B151b-Fire safety specialist'!F31=\"\",\"\",\"LIST\")","v":""}]
[null,"DPF - 009",{"$f":"'B151b-Fire safety specialist'!F32","v":0},null,{"$f":"'B151b-Fire safety specialist'!G32","v":0}]
[null,null,{"$f":"IF('B151b-Fire safety specialist'!F32=\"\",\"\",\"LIST\")","v":""}]
[null,"DPF - 010",{"$f":"'B151b-Fire safety specialist'!F33","v":0},null,{"$f":"'B151b-Fire safety specialist'!G33","v":0}]
[null,null,{"$f":"IF('B151b-Fire safety specialist'!F33=\"\",\"\",\"LIST\")","v":""}]
[null,"DPF - 011",{"$f":"'B151b-Fire safety specialist'!F34","v":0},null,{"$f":"'B151b-Fire safety specialist'!G34","v":0}]
[null,null,{"$f":"IF('B151b-Fire safety specialist'!F34=\"\",\"\",\"LIST\")","v":""}]
[null,"DPF - 012",{"$f":"'B151b-Fire safety specialist'!F35","v":0},null,{"$f":"'B151b-Fire safety specialist'!G35","v":0}]
[null,null,{"$f":"IF('B151b-Fire safety specialist'!F35=\"\",\"\",\"LIST\")","v":""}]
[null,"DPF - 013",{"$f":"'B151b-Fire safety specialist'!F36","v":0},null,{"$f":"'B151b-Fire safety specialist'!G36","v":0}]
[null,null,{"$f":"IF('B151b-Fire safety specialist'!F36=\"\",\"\",\"LIST\")","v":""}]
[null,"DPF - 014",{"$f":"'B151b-Fire safety specialist'!F37","v":0},null,{"$f":"'B151b-Fire safety specialist'!G37","v":0}]
[null,null,{"$f":"IF('B151b-Fire safety specialist'!F37=\"\",\"\",\"LIST\")","v":""}]
[null,"DPF - 015",{"$f":"'B151b-Fire safety specialist'!F39","v":0},null,{"$f":"'B151b-Fire safety specialist'!G39","v":0}]
[null,null,{"$f":"IF('B151b-Fire safety specialist'!F39=\"\",\"\",\"LIST\")","v":""}]
[null,null,{"$f":"IF('B160-PS specialist'!N23>1,'B160-PS specialist'!T23,\"\")","v":"Specialist Review : Mechanical Ventilation  (Nick Waddington )"}]
[null,"SER - 001",{"$f":"'B160-PS specialist'!F21","v":"The specialist services reviewer of this application requires the following additional information:\n\nPlease provide PS1 (Design) and associated design details, showing Compliance with Clauses G4 and H1.3.6 of the New Zealand Building Code. Also, a schedule of inspections to be undertaken by the engineer with confirmation that 'as built' drawings and a PS4 will be provided on successful commissioning of the ventilation systems.                      Response received 12/7/17 does not address RFI                                            Response received 1/8/17 gives no indication of how internal office and meeting room are ventilated, does not give any extract rates for toilets and PS1 provided gives no indication that PS4 will be provided.\n"},null,{"$f":"'B160-PS specialist'!G21","v":"Resolved"}]
[null,null,{"$f":"IF('B160-PS specialist'!F21=\"\",\"\",\"LIST\")","v":"LIST"}]
[null,"SER - 002",{"$f":"'B160-PS specialist'!F22","v":0},null,{"$f":"'B160-PS specialist'!G22","v":0}]
[null,null,{"$f":"IF('B160-PS specialist'!F22=\"\",\"\",\"LIST\")","v":""}]
[null,"SER - 003",{"$f":"'B160-PS specialist'!F23","v":0},null,{"$f":"'B160-PS specialist'!G23","v":0}]
[null,null,{"$f":"IF('B160-PS specialist'!F23=\"\",\"\",\"LIST\")","v":""}]
[null,null,{"$f":"IF('B160-PS specialist'!N26>1,'B160-PS specialist'!P26,\"\")","v":""}]
[null,"SER - 004",{"$f":"'B160-PS specialist'!F25","v":0},null,{"$f":"'B160-PS specialist'!G25","v":0}]
[null,null,{"$f":"IF('B160-PS specialist'!F25=\"\",\"\",\"LIST\")","v":""}]
[null,"SER - 005",{"$f":"'B160-PS specialist'!F26","v":0},null,{"$f":"'B160-PS specialist'!G26","v":0}]
[null,null,{"$f":"IF('B160-PS specialist'!F26=\"\",\"\",\"LIST\")","v":""}]
[null,null,{"$f":"IF('B160-PS specialist'!N29>1,'B160-PS specialist'!P32,\"\")","v":""}]
[null,"SER - 006",{"$f":"'B160-PS specialist'!F28","v":0},null,{"$f":"'B160-PS specialist'!G28","v":0}]
[null,null,{"$f":"IF('B160-PS specialist'!F28=\"\",\"\",\"LIST\")","v":""}]
[null,"SER - 007",{"$f":"'B160-PS specialist'!F29","v":0},null,{"$f":"'B160-PS specialist'!G29","v":0}]
[null,null,{"$f":"IF('B160-PS specialist'!F29=\"\",\"\",\"LIST\")","v":""}]
[]
[null,"An early response will assist in the completion of consent processing with minimal delays.\n\nWhen replying to our request, please provide a covering letter stating what action has been taken for each item, and highlight all changes to revised documentation."]
[]
[null,"To submit the requested documentation:\n.          Use the Upload additional information option at http://onlineservices.ccc.govt.nz. If you are \n           not already registered for Online Services, you can register for free at any time at \n           http://onlineservices.ccc.govt.nz. For more information, see www.ccc.govt.nz/bcguide. \n.          Alternatively, you can post or deliver your application to the address below. However, you \n           can eliminate scanning fees, and reduce processing fees and delays, by submitting \n           documents online."]
[null,"Please do not lock or password‐protect PDFs, as they have to be merged into final consent documents. This letter is sent to the applicant and the owner, where possible."]
[null,"Yours sincerely"]
[null,null,"."]
[null,null,"."]
[null,null,"."]
[null,{"$f":"'Summary sheet'!E51","v":"Tania McGrath"}]
[null,{"$f":"'Summary sheet'!E52","v":"Building Consent Officer"}]

{"sheet":"B521-RFI letter","index":3,"n_rows":610,"n_cols":14,"rows_kept":610,"cut":false,"hidden":false,"merged":[[8,5,8,6],[602,1,602,4],[603,1,603,4],[604,1,604,2],[601,1,601,4],[600,1,600,4],[1,1,1,2],[16,1,17,4],[3,1,3,2],[4,1,4,2],[5,1,5,2],[6,1,6,2],[9,1,9,2],[13,1,13,3],[12,1,12,3]]}
[]
[null,{"$f":"TODAY( )","v":"2017-08-20"},null,null,null,"Summary sheet","B501-Not accepted letter"]
[null,null,null,null,null,"Vetting sheet","B501a-Not accepted with invoice"]
[null,{"$f":"'Summary sheet'!$E$7","v":"Trevor Jones "},null,null,null,"B120-Processing sheet","Application update letter"]
[null,{"$f":"'Summary sheet'!E9","v":"47 Second Avenue , Tauranga"},null,null,null,"B150-Structural specialist","B521-RFI letter"]
[null,{"$f":"'Summary sheet'!$E$10","v":"Tauranga"},null,null,null,"B151a-Fire safety specialist","B529-Final reminder letter"]
[null,{"$f":"'Summary sheet'!E8","v":"trevor@architecturaldesigngroup.co.nz"},null,null,null,"B151b-Fire safety specialist","B532-Refusal letter"]
[null,"a","a",null,null,"B160-PS specialist","S71-74 natural hazards"]
[null,"a","a",null,null,"B462-Draft CS"]
[null,{"$f":"\"Dear\"&\" \"&'Summary sheet'!E11","v":"Dear Sir / Madam"}]
[null,"a","a"]
[null,{"$f":"'Summary sheet'!I15&\" \"&'Summary sheet'!E15","v":"Building Consent: BCN/2017/2013"}]
[null,{"$f":"'Summary sheet'!$E$16","v":"80 Byron Street Sydenham "},null,null,null,null,null,null,null,null,null,null,null,{"$f":"B13","v":"80 Byron Street Sydenham "}]
[null,{"$f":"'Summary sheet'!$E$17","v":"Addition to Factory - New Offices, Meeting and Store Room"},null,null,null,null,null,null,null,null,null,null,null,{"$f":"B14","v":"Addition to Factory - New Offices, Meeting and Store Room"}]
[null,"a","a"]
[null,"Request for information"]
[null,"All reviews have now started for the above application. However, we require further information to enable the Council to process your application.\n"]
[]
[null,"a","a"]
[null,"RFI Code\n","RFI Items\n",null,"Status\n"]
[null,"GEN - 001",{"$f":"'B120-Processing sheet'!F15","v":0},null,{"$f":"'B120-Processing sheet'!G15","v":0}]
[null,null,{"$f":"IF('B120-Processing sheet'!F15=\"\",\"\",\"LIST\")","v":""}]
[null,"GEN - 001A",{"$f":"'B120-Processing sheet'!F16","v":0},null,{"$f":"'B120-Processing sheet'!G16","v":0}]
[null,null,{"$f":"IF('B120-Processing sheet'!F16=\"\",\"\",\"LIST\")","v":""}]
[null,"GEN - 001B",{"$f":"'B120-Processing sheet'!F17","v":0},null,{"$f":"'B120-Processing sheet'!G17","v":0}]
[null,null,{"$f":"IF('B120-Processing sheet'!F17=\"\",\"\",\"LIST\")","v":""}]
[null,"GEN - 002",{"$f":"'B120-Processing sheet'!F18","v":0},null,{"$f":"'B120-Processing sheet'!G18","v":0}]
[null,null,{"$f":"IF('B120-Processing sheet'!F18=\"\",\"\",\"LIST\")","v":""}]
[null,"GEN - 003",{"$f":"'B120-Processing sheet'!F19","v":0},null,{"$f":"'B120-Processing sheet'!G19","v":0}]
[null,null,{"$f":"IF('B120-Processing sheet'!F19=\"\",\"\",\"LIST\")","v":""}]
[null,"GEN - 004",{"$f":"'B120-Processing sheet'!F20","v":0},null,{"$f":"'B120-Processing sheet'!G20","v":0}]
[null,null,{"$f":"IF('B120-Processing sheet'!F20=\"\",\"\",\"LIST\")","v":""}]
[null,"GEN - 005",{"$f":"'B120-Processing sheet'!F21","v":0},null,{"$f":"'B120-Processing sheet'!G21","v":0}]
[null,null,{"$f":"IF('B120-Processing sheet'!F21=\"\",\"\",\"LIST\")","v":""}]
[null,"GEN - 006",{"$f":"'B120-Processing sheet'!F22","v":"Provide on the site plan, sufficient levels to establish compliance with [B1, E1, E2, G13, City Plan]. These should include new and existing finished floor levels and site levels to Christchurch Drainage Datum, including datum point location."},null,{"$f":"'B120-Processing sheet'!G22","v":"Resolved"}]
[null,null,{"$f":"IF('B120-Processing sheet'!F22=\"\",\"\",\"LIST\")","v":"LIST"}]
[null,"GEN - 007",{"$f":"'B120-Processing sheet'!F23","v":"Please indicate the location of the block wall on the site plan in relation to the boundary to demonstrate that this building will be constructed within the boundaries of the property (including foundations).\n\n13/07/07 - thank you for your response, however the survey plan suggests that the existing building may be constructed over the boundary. Please confirm that the addition will be constructed wholly within the boundaries of this property, note you will be required to supply a building location certificate at setout of the foundation to confirm that the addition is within the property boundary."},null,{"$f":"'B120-Processing sheet'!G23","v":"Resolved"}]
[null,null,{"$f":"IF('B120-Processing sheet'!F23=\"\",\"\",\"LIST\")","v":"LIST"}]
[null,"GEN - 008",{"$f":"'B120-Processing sheet'!F24","v":0},null,{"$f":"'B120-Processing sheet'!G24","v":0}]
[null,null,{"$f":"IF('B120-Processing sheet'!F24=\"\",\"\",\"LIST\")","v":""}]
[null,"GEN - 009",{"$f":"'B120-Processing sheet'!F25","v":0},null,{"$f":"'B120-Processing sheet'!G25","v":0}]
[null,null,{"$f":"IF('B120-Processing sheet'!F25=\"\",\"\",\"LIST\")","v":""}]
[null,"GEN - 010",{"$f":"'B120-Processing sheet'!F26","v":"Please provide a site specific sediment control plan taking into consideration any drainage outlets that may be existing on site hardstanding area."},null,{"$f":"'B120-Processing sheet'!G26","v":"Resolved"}]
[null,null,{"$f":"IF('B120-Processing sheet'!F26=\"\",\"\",\"LIST\")","v":"LIST"}]
[null,"GEN - 011",{"$f":"'B120-Processing sheet'!F27","v":0},null,{"$f":"'B120-Processing sheet'!G27","v":0}]
[null,null,{"$f":"IF('B120-Processing sheet'!F27=\"\",\"\",\"LIST\")","v":""}]
[null,"GEN - 012",{"$f":"'B120-Processing sheet'!F28","v":"Please provide schedule of construction monitoring that will be conducted by the structural engineer and confirm that a PS4 will be provided when construction complete."},null,{"$f":"'B120-Processing sheet'!G28","v":"Resolved"}]
[null,null,{"$f":"IF('B120-Processing sheet'!F28=\"\",\"\",\"LIST\")","v":"LIST"}]
[null,"BA - 013",{"$f":"'B120-Processing sheet'!F30","v":0},null,{"$f":"'B120-Processing sheet'!G30","v":0}]
[null,null,{"$f":"IF('B120-Processing sheet'!F30=\"\",\"\",\"LIST\")","v":""}]
[null,"B1 - 014",{"$f":"'B120-Processing sheet'!F32","v":0},null,{"$f":"'B120-Processing sheet'!G32","v":0}]
[null,null,{"$f":"IF('B120-Processing sheet'!F32=\"\",\"\",\"LIST\")","v":""}]
[null,"B1 - 015",{"$f":"'B120-Processing sheet'!F33","v":0},null,{"$f":"'B120-Processing sheet'!G33","v":0}]
[null,null,{"$f":"IF('B120-Processing sheet'!F33=\"\",\"\",\"LIST\")","v":""}]
[null,"B1 - 016",{"$f":"'B120-Processing sheet'!F34","v":"1. Please provide a copy of the structural engineering calculations to allow for assessment of compliance with the requirements of B1. RESOLVED\n\n2. Please provide details of how it is intended to connect the new walls to the existing external walls of the building sufficient to demonstrate compliance with requirements of B1 taking into consideration that the design features report indicates that the buildings will be seismically separated however the foundations have been tied together. RESOLVED\n\n3. The information available to Council indicates the presence of external metal structures that appear to be potentially providing additional structural support to the existing building. Please confirm if this is occuring and if so how will that structural element continue to be maintained when the new addition is added. RESOLVED\n\n4. Please provide detail demonstrating how the roof brace in connected to structural elements on Grid line 2 and the central SHS post on Gridline 1 sufficient to demonstrate compliance with the requirements of B1. RESOLVED\n\n5. Please provide documentation to demonstrate that the lateral stability of the stack bond block walls has been achieved sufficient to demonstrate compliance with B1. RESOLVED\n\n6. Please provide a bracing plan and calculations sufficient to demonstrate compliance with the requirements of B1. RESOLVED\n\n7. The lintel above the sliding door appears to be specific design. Please provide documentation to support the size of the lintel indicated in detail 17 sheet A16. RESOLVED\n\n8. The drawings indicate that the opening in the existing wall will be significantly extended. Please provide details of the support for this opening and evidence that the bracing of the existing building can be maintained with this new opening.\n\n14/07/17 - Unable to locate information within engineering calculations as indicated - please direct me to where this information is located."},null,{"$f":"'B120-Processing sheet'!G34","v":"Resolved"}]
[null,null,{"$f":"IF('B120-Processing sheet'!F34=\"\",\"\",\"LIST\")","v":"LIST"}]
[null,"B1 - 017",{"$f":"'B120-Processing sheet'!F35","v":0},null,{"$f":"'B120-Processing sheet'!G35","v":0}]
[null,null,{"$f":"IF('B120-Processing sheet'!F35=\"\",\"\",\"LIST\")","v":""}]
[null,"B1 - 018",{"$f":"'B120-Processing sheet'!F36","v":0},null,{"$f":"'B120-Processing sheet'!G36","v":0}]
[null,null,{"$f":"IF('B120-Processing sheet'!F36=\"\",\"\",\"LIST\")","v":""}]
[null,"B1 - 019",{"$f":"'B120-Processing sheet'!F37","v":0},null,{"$f":"'B120-Processing sheet'!G37","v":0}]
[null,null,{"$f":"IF('B120-Processing sheet'!F37=\"\",\"\",\"LIST\")","v":""}]
[null,"B1 - 020",{"$f":"'B120-Processing sheet'!F38","v":"As this project involves connection with the existing building please provide a Detailed Engineering Evaluation (DEE) for the existing building.\n\n13/07/17 - Your response refers to a report by Holmes Consulting, however no report was received"},null,{"$f":"'B120-Processing sheet'!G38","v":"Resolved"}]
[null,null,{"$f":"IF('B120-Processing sheet'!F38=\"\",\"\",\"LIST\")","v":"LIST"}]
[null,"B1 - 021",{"$f":"'B120-Processing sheet'!F39","v":0},null,{"$f":"'B120-Processing sheet'!G39","v":0}]
[null,null,{"$f":"IF('B120-Processing sheet'!F39=\"\",\"\",\"LIST\")","v":""}]
[null,"B1 - 022",{"$f":"'B120-Processing sheet'!F41","v":0},null,{"$f":"'B120-Processing sheet'!G41","v":0}]
[null,null,{"$f":"IF('B120-Processing sheet'!F41=\"\",\"\",\"LIST\")","v":""}]
[null,"B1 - 023",{"$f":"'B120-Processing sheet'!F42","v":0},null,{"$f":"'B120-Processing sheet'!G42","v":0}]
[null,null,{"$f":"IF('B120-Processing sheet'!F42=\"\",\"\",\"LIST\")","v":""}]
[null,"B1 - 024",{"$f":"'B120-Processing sheet'!F43","v":0},null,{"$f":"'B120-Processing sheet'!G43","v":0}]
[null,null,{"$f":"IF('B120-Processing sheet'!F43=\"\",\"\",\"LIST\")","v":""}]
[null,"B1 - 025",{"$f":"'B120-Processing sheet'!F44","v":0},null,{"$f":"'B120-Processing sheet'!G44","v":0}]
[null,null,{"$f":"IF('B120-Processing sheet'!F44=\"\",\"\",\"LIST\")","v":""}]
[null,"B1 - 026",{"$f":"'B120-Processing sheet'!F45","v":0},null,{"$f":"'B120-Processing sheet'!G45","v":0}]
[null,null,{"$f":"IF('B120-Processing sheet'!F45=\"\",\"\",\"LIST\")","v":""}]
[null,"B1 - 027",{"$f":"'B120-Processing sheet'!F46","v":0},null,{"$f":"'B120-Processing sheet'!G46","v":0}]
[null,null,{"$f":"IF('B120-Processing sheet'!F46=\"\",\"\",\"LIST\")","v":""}]
[null,"B1 - 028",{"$f":"'B120-Processing sheet'!F47","v":0},null,{"$f":"'B120-Processing sheet'!G47","v":0}]
[null,null,{"$f":"IF('B120-Processing sheet'!F47=\"\",\"\",\"LIST\")","v":""}]
[null,"B1 - 029",{"$f":"'B120-Processing sheet'!F48","v":0},null,{"$f":"'B120-Processing sheet'!G48","v":0}]
[null,null,{"$f":"IF('B120-Processing sheet'!F48=\"\",\"\",\"LIST\")","v":""}]
[null,"B1 - 030",{"$f":"'B120-Processing sheet'!F49","v":0},null,{"$f":"'B120-Processing sheet'!G49","v":0}]
[null,null,{"$f":"IF('B120-Processing sheet'!F49=\"\",\"\",\"LIST\")","v":""}]
[null,"B1 - 031",{"$f":"'B120-Processing sheet'!F50","v":0},null,{"$f":"'B120-Processing sheet'!G50","v":0}]
[null,null,{"$f":"IF('B120-Processing sheet'!F50=\"\",\"\",\"LIST\")","v":""}]
[null,"B1 - 032",{"$f":"'B120-Processing sheet'!F51","v":0},null,{"$f":"'B120-Processing sheet'!G51","v":0}]
[null,null,{"$f":"IF('B120-Processing sheet'!F51=\"\",\"\",\"LIST\")","v":""}]
[null,"B1 - 033",{"$f":"'B120-Processing sheet'!F52","v":0},null,{"$f":"'B120-Processing sheet'!G52","v":0}]
[null,null,{"$f":"IF('B120-Processing sheet'!F52=\"\",\"\",\"LIST\")","v":""}]
[null,"B1 - 034",{"$f":"'B120-Processing sheet'!F53","v":0},null,{"$f":"'B120-Processing sheet'!G53","v":0}]
[null,null,{"$f":"IF('B120-Processing sheet'!F53=\"\",\"\",\"LIST\")","v":""}]
[null,"B1 - 035",{"$f":"'B120-Processing sheet'!F54","v":0},null,{"$f":"'B120-Processing sheet'!G54","v":0}]
[null,null,{"$f":"IF('B120-Processing sheet'!F54=\"\",\"\",\"LIST\")","v":""}]
[null,"B1 - 036",{"$f":"'B120-Processing sheet'!F55","v":0},null,{"$f":"'B120-Processing sheet'!G55","v":0}]
[null,null,{"$f":"IF('B120-Processing sheet'!F55=\"\",\"\",\"LIST\")","v":""}]
[null,"B1 - 037",{"$f":"'B120-Processing sheet'!F56","v":0},null,{"$f":"'B120-Processing sheet'!G56","v":0}]
[null,null,{"$f":"IF('B120-Processing sheet'!F56=\"\",\"\",\"LIST\")","v":""}]
[null,"B1 - 038",{"$f":"'B120-Processing sheet'!F57","v":0},null,{"$f":"'B120-Processing sheet'!G57","v":0}]
[null,null,{"$f":"IF('B120-Processing sheet'!F57=\"\",\"\",\"LIST\")","v":""}]
[null,"B1 - 039",{"$f":"'B120-Processing sheet'!F58","v":0},null,{"$f":"'B120-Processing sheet'!G58","v":0}]
[null,null,{"$f":"IF('B120-Processing sheet'!F58=\"\",\"\",\"LIST\")","v":""}]
[null,"B1 - 040",{"$f":"'B120-Processing sheet'!F59","v":0},null,{"$f":"'B120-Processing sheet'!G59","v":0}]
[null,null,{"$f":"IF('B120-Processing sheet'!F59=\"\",\"\",\"LIST\")","v":""}]
[null,"B1 - 041",{"$f":"'B120-Processing sheet'!F60","v":0},null,{"$f":"'B120-Processing sheet'!G60","v":0}]
[null,null,{"$f":"IF('B120-Processing sheet'!F60=\"\",\"\",\"LIST\")","v":""}]
[null,"B1 - 042",{"$f":"'B120-Processing sheet'!F61","v":0},null,{"$f":"'B120-Processing sheet'!G61","v":0}]
[null,null,{"$f":"IF('B120-Processing sheet'!F61=\"\",\"\",\"LIST\")","v":""}]
[null,"B1 - 043",{"$f":"'B120-Processing sheet'!F62","v":0},null,{"$f":"'B120-Processing sheet'!G62","v":0}]
[null,null,{"$f":"IF('B120-Processing sheet'!F62=\"\",\"\",\"LIST\")","v":""}]
[null,"B1 - 044",{"$f":"'B120-Processing sheet'!F63","v":0},null,{"$f":"'B120-Processing sheet'!G63","v":0}]
[null,null,{"$f":"IF('B120-Processing sheet'!F63=\"\",\"\",\"LIST\")","v":""}]
[null,"B1 - 045",{"$f":"'B120-Processing sheet'!F64","v":0},null,{"$f":"'B120-Processing sheet'!G64","v":0}]
[null,null,{"$f":"IF('B120-Processing sheet'!F64=\"\",\"\",\"LIST\")","v":""}]
[null,"B1 - 046",{"$f":"'B120-Processing sheet'!F65","v":0},null,{"$f":"'B120-Processing sheet'!G65","v":0}]
[null,null,{"$f":"IF('B120-Processing sheet'!F65=\"\",\"\",\"LIST\")","v":""}]
[null,"B1 - 047",{"$f":"'B120-Processing sheet'!F66","v":0},null,{"$f":"'B120-Processing sheet'!G66","v":0}]
[null,null,{"$f":"IF('B120-Processing sheet'!F66=\"\",\"\",\"LIST\")","v":""}]
[null,"B1 - 048",{"$f":"'B120-Processing sheet'!F67","v":0},null,{"$f":"'B120-Processing sheet'!G67","v":0}]
[null,null,{"$f":"IF('B120-Processing sheet'!F67=\"\",\"\",\"LIST\")","v":""}]
[null,"B1 - 049",{"$f":"'B120-Processing sheet'!F68","v":"Please review the internal wall framing spacings taking into consideration the wall height of 2.7m. 90x45 @ 600mm centres does not meet the requirements of Table 8.2 NZS3604:2011."},null,{"$f":"'B120-Processing sheet'!G68","v":"Resolved"}]
[null,null,{"$f":"IF('B120-Processing sheet'!F68=\"\",\"\",\"LIST\")","v":"LIST"}]
[null,"B1 - 050",{"$f":"'B120-Processing sheet'!F69","v":0},null,{"$f":"'B120-Processing sheet'!G69","v":0}]
[null,null,{"$f":"IF('B120-Processing sheet'!F69=\"\",\"\",\"LIST\")","v":""}]
[null,"B1 - 051",{"$f":"'B120-Processing sheet'!F70","v":0},null,{"$f":"'B120-Processing sheet'!G70","v":0}]
[null,null,{"$f":"IF('B120-Processing sheet'!F70=\"\",\"\",\"LIST\")","v":""}]
[null,"B1 - 052",{"$f":"'B120-Processing sheet'!F71","v":0},null,{"$f":"'B120-Processing sheet'!G71","v":0}]
[null,null,{"$f":"IF('B120-Processing sheet'!F71=\"\",\"\",\"LIST\")","v":""}]
[null,"B1 - 053",{"$f":"'B120-Processing sheet'!F72","v":0},null,{"$f":"'B120-Processing sheet'!G72","v":0}]
[null,null,{"$f":"IF('B120-Processing sheet'!F72=\"\",\"\",\"LIST\")","v":""}]
[null,"B1 - 054",{"$f":"'B120-Processing sheet'!F73","v":0},null,{"$f":"'B120-Processing sheet'!G73","v":0}]
[null,null,{"$f":"IF('B120-Processing sheet'!F73=\"\",\"\",\"LIST\")","v":""}]
[null,"B1 - 055",{"$f":"'B120-Processing sheet'!F74","v":"Detail 11 sheet A15 indicates the presence of outriggers please provide sufficient details to demonstrate compliance with B1. A roof framing plan may be appropriate which includes length of outrigger over hang and the support for the metal roofing at the eave."},null,{"$f":"'B120-Processing sheet'!G74","v":"Resolved"}]
[null,null,{"$f":"IF('B120-Processing sheet'!F74=\"\",\"\",\"LIST\")","v":"LIST"}]
[null,"B1 - 056",{"$f":"'B120-Processing sheet'!F75","v":0},null,{"$f":"'B120-Processing sheet'!G75","v":0}]
[null,null,{"$f":"IF('B120-Processing sheet'!F75=\"\",\"\",\"LIST\")","v":""}]
[null,"B1 - 057",{"$f":"'B120-Processing sheet'!F76","v":0},null,{"$f":"'B120-Processing sheet'!G76","v":0}]
[null,null,{"$f":"IF('B120-Processing sheet'!F76=\"\",\"\",\"LIST\")","v":""}]
[null,"B1 - 058",{"$f":"'B120-Processing sheet'!F77","v":0},null,{"$f":"'B120-Processing sheet'!G77","v":0}]
[null,null,{"$f":"IF('B120-Processing sheet'!F77=\"\",\"\",\"LIST\")","v":""}]
[null,"B1 - 059",{"$f":"'B120-Processing sheet'!F78","v":0},null,{"$f":"'B120-Processing sheet'!G78","v":0}]
[null,null,{"$f":"IF('B120-Processing sheet'!F78=\"\",\"\",\"LIST\")","v":""}]
[null,"B1 - 060",{"$f":"'B120-Processing sheet'!F79","v":0},null,{"$f":"'B120-Processing sheet'!G79","v":0}]
[null,null,{"$f":"IF('B120-Processing sheet'!F79=\"\",\"\",\"LIST\")","v":""}]
[null,"B1 - 061",{"$f":"'B120-Processing sheet'!F80","v":0},null,{"$f":"'B120-Processing sheet'!G80","v":0}]
[null,null,{"$f":"IF('B120-Processing sheet'!F80=\"\",\"\",\"LIST\")","v":""}]
[null,"B1 - 062",{"$f":"'B120-Processing sheet'!F81","v":0},null,{"$f":"'B120-Processing sheet'!G81","v":0}]
[null,null,{"$f":"IF('B120-Processing sheet'!F81=\"\",\"\",\"LIST\")","v":""}]
[null,"B2 - 063",{"$f":"'B120-Processing sheet'!F83","v":0},null,{"$f":"'B120-Processing sheet'!G83","v":0}]
[null,null,{"$f":"IF('B120-Processing sheet'!F83=\"\",\"\",\"LIST\")","v":""}]
[null,"B2 - 064",{"$f":"'B120-Processing sheet'!F84","v":"Please provide finished floor level for the addition. Whilst it is noted that the building does not need to meet the requirements of E1, it will be required to achieve compliance with 50 year durability requirements. As the internal of the building consistents of structural elements which are susceptible to the impact of moisture please provide details of how it is intended to ensure the structural integrity of these elements.\n\n13/07/17 - thank you for the revised detail for the internal walls, however it has been noted there is a timber external wall which provides some structural support and will also require protection. Please review/revise as appropriate."},null,{"$f":"'B120-Processing sheet'!G84","v":"Resolved"}]
[null,null,{"$f":"IF('B120-Processing sheet'!F84=\"\",\"\",\"LIST\")","v":"LIST"}]
[null,"B2 - 065",{"$f":"'B120-Processing sheet'!F85","v":0},null,{"$f":"'B120-Processing sheet'!G85","v":0}]
[null,null,{"$f":"IF('B120-Processing sheet'!F85=\"\",\"\",\"LIST\")","v":""}]
[null,"B2 - 066",{"$f":"'B120-Processing sheet'!F86","v":0},null,{"$f":"'B120-Processing sheet'!G86","v":0}]
[null,null,{"$f":"IF('B120-Processing sheet'!F86=\"\",\"\",\"LIST\")","v":""}]
[null,"B2 - 067",{"$f":"'B120-Processing sheet'!F87","v":0},null,{"$f":"'B120-Processing sheet'!G87","v":0}]
[null,null,{"$f":"IF('B120-Processing sheet'!F87=\"\",\"\",\"LIST\")","v":""}]
[null,"B2 - 068",{"$f":"'B120-Processing sheet'!F88","v":0},null,{"$f":"'B120-Processing sheet'!G88","v":0}]
[null,null,{"$f":"IF('B120-Processing sheet'!F88=\"\",\"\",\"LIST\")","v":""}]
[null,"C1 - 069",{"$f":"'B120-Processing sheet'!F90","v":0},null,{"$f":"'B120-Processing sheet'!G90","v":0}]
[null,null,{"$f":"IF('B120-Processing sheet'!F90=\"\",\"\",\"LIST\")","v":""}]
[null,"D1 – 070",{"$f":"'B120-Processing sheet'!F92","v":0},null,{"$f":"'B120-Processing sheet'!G92","v":0}]
[null,null,{"$f":"IF('B120-Processing sheet'!F92=\"\",\"\",\"LIST\")","v":""}]
[null,"D1 – 071",{"$f":"'B120-Processing sheet'!F93","v":0},null,{"$f":"'B120-Processing sheet'!G93","v":0}]
[null,null,{"$f":"IF('B120-Processing sheet'!F93=\"\",\"\",\"LIST\")","v":""}]
[null,"D1 – 072",{"$f":"'B120-Processing sheet'!F94","v":0},null,{"$f":"'B120-Processing sheet'!G94","v":0}]
[null,null,{"$f":"IF('B120-Processing sheet'!F94=\"\",\"\",\"LIST\")","v":""}]
[null,"D1 – 073",{"$f":"'B120-Processing sheet'!F95","v":0},null,{"$f":"'B120-Processing sheet'!G95","v":0}]
[null,null,{"$f":"IF('B120-Processing sheet'!F95=\"\",\"\",\"LIST\")","v":""}]
[null,"D1 – 074",{"$f":"'B120-Processing sheet'!F96","v":"1. Please provide finished floor level between the existing and new floors sufficient to demonstrate compliance with the requirement of D1 in relation to isolated steps. RESOLVED\n\n2. Please review detail 18 sheet A16. The installation of the channel drain 100mm below the finished floor level and also door sill indicates the presence of an isolated step at this entrance which does not comply with the requirements of D1.\n\n13/07/17 - Thank you for the revised detail, however the dimensions provide are not within the scope of D1/AS1 4.1.1 and figure 11 ie risers of less than 150mm (less than 23 degree pitch) are not acceptable - Please review as appropriate. For this to be reviewed as an alterntive solution sufficient information to demonstrate compliance with D1 will be required.\n\n02/08/17 - Thank you for the details, however as you have indicated two risers please provide the details of the handrail sufficient to demonstrate compliance with the requirements of D1.3.2(K)."},null,{"$f":"'B120-Processing sheet'!G96","v":"Resolved"}]
[null,null,{"$f":"IF('B120-Processing sheet'!F96=\"\",\"\",\"LIST\")","v":"LIST"}]
[null,"D1 – 075",{"$f":"'B120-Processing sheet'!F97","v":0},null,{"$f":"'B120-Processing sheet'!G97","v":0}]
[null,null,{"$f":"IF('B120-Processing sheet'!F97=\"\",\"\",\"LIST\")","v":""}]
[null,"D1 – 076",{"$f":"'B120-Processing sheet'!F98","v":0},null,{"$f":"'B120-Processing sheet'!G98","v":0}]
[null,null,{"$f":"IF('B120-Processing sheet'!F98=\"\",\"\",\"LIST\")","v":""}]
[null,"D1 – 077",{"$f":"'B120-Processing sheet'!F99","v":0},null,{"$f":"'B120-Processing sheet'!G99","v":0}]
[null,null,{"$f":"IF('B120-Processing sheet'!F99=\"\",\"\",\"LIST\")","v":""}]
[null,"D1 – 078",{"$f":"'B120-Processing sheet'!F100","v":"Please provide a sill detail for door indicated on the East side of the addition sufficient to demonstrate compliance with the requirements of D1 and E2 in relation to accessible route."},null,{"$f":"'B120-Processing sheet'!G100","v":"Resolved"}]
[null,null,{"$f":"IF('B120-Processing sheet'!F100=\"\",\"\",\"LIST\")","v":"LIST"}]
[null,"D1 – 079",{"$f":"'B120-Processing sheet'!F101","v":0},null,{"$f":"'B120-Processing sheet'!G101","v":0}]
[null,null,{"$f":"IF('B120-Processing sheet'!F101=\"\",\"\",\"LIST\")","v":""}]
[null,"D1 – 080",{"$f":"'B120-Processing sheet'!F102","v":0},null,{"$f":"'B120-Processing sheet'!G102","v":0}]
[null,null,{"$f":"IF('B120-Processing sheet'!F102=\"\",\"\",\"LIST\")","v":""}]
[null,"D1 – 081",{"$f":"'B120-Processing sheet'!F103","v":0},null,{"$f":"'B120-Processing sheet'!G103","v":0}]
[null,null,{"$f":"IF('B120-Processing sheet'!F103=\"\",\"\",\"LIST\")","v":""}]
[null,"D1 – 082",{"$f":"'B120-Processing sheet'!F104","v":0},null,{"$f":"'B120-Processing sheet'!G104","v":0}]
[null,null,{"$f":"IF('B120-Processing sheet'!F104=\"\",\"\",\"LIST\")","v":""}]
[null,"D1 – 083",{"$f":"'B120-Processing sheet'!F105","v":0},null,{"$f":"'B120-Processing sheet'!G105","v":0}]
[null,null,{"$f":"IF('B120-Processing sheet'!F105=\"\",\"\",\"LIST\")","v":""}]
[null,"D1 – 084",{"$f":"'B120-Processing sheet'!F106","v":0},null,{"$f":"'B120-Processing sheet'!G106","v":0}]
[null,null,{"$f":"IF('B120-Processing sheet'!F106=\"\",\"\",\"LIST\")","v":""}]
[null,"D1 – 085",{"$f":"'B120-Processing sheet'!F107","v":0},null,{"$f":"'B120-Processing sheet'!G107","v":0}]
[null,null,{"$f":"IF('B120-Processing sheet'!F107=\"\",\"\",\"LIST\")","v":""}]
[null,"D2 – 086",{"$f":"'B120-Processing sheet'!F109","v":0},null,{"$f":"'B120-Processing sheet'!G109","v":0}]
[null,null,{"$f":"IF('B120-Processing sheet'!F109=\"\",\"\",\"LIST\")","v":""}]
[null,"D2 – 087",{"$f":"'B120-Processing sheet'!F110","v":0},null,{"$f":"'B120-Processing sheet'!G110","v":0}]
[null,null,{"$f":"IF('B120-Processing sheet'!F110=\"\",\"\",\"LIST\")","v":""}]
[null,"E1 – 088",{"$f":"'B120-Processing sheet'!F112","v":0},null,{"$f":"'B120-Processing sheet'!G112","v":0}]
[null,null,{"$f":"IF('B120-Processing sheet'!F112=\"\",\"\",\"LIST\")","v":""}]
[null,"E1 – 089",{"$f":"'B120-Processing sheet'!F113","v":"Please provide FFL and the ground to  floor separation. 13/07/2017 Resolved See TRIM 17/741973"},null,{"$f":"'B120-Processing sheet'!G113","v":"Resolved"}]
[null,null,{"$f":"IF('B120-Processing sheet'!F113=\"\",\"\",\"LIST\")","v":"LIST"}]
[null,"E1 – 090",{"$f":"'B120-Processing sheet'!F114","v":"• Authorisation For The Discharge Of Stormwater Into CCC Network: To comply with the New Zealand Building Code stormwater discharge from this property must avoid the likelihood of damage to the outfall in a manner acceptable to the Council’s Assets And Network Unit. In addition, the Council requires stormwater discharge compliance with Environment Canterbury’s regional rules and holds a number of discharge consents throughout its territory which it may use to authorise the discharge of stormwater into its network. Compliance with relevant consent conditions may require onsite stormwater mitigation (treatment and/or attenuation/disposal). Before a Building Consent can be issued you must seek authorisation from Council’s Assets And Network Unit by contacting Stormwater.Approvals@ccc.govt.nz. If Council does not authorise the stormwater discharge under one of its global consents, separate authorisation from Environment Canterbury may be required prior to a Building Consent being issued. The obtained authorisation must be included with the supporting documents of your building consent application.  13/07/2017 Resolved See TRIM 17/363256"},null,{"$f":"'B120-Processing sheet'!G114","v":"Resolved"}]
[null,null,{"$f":"IF('B120-Processing sheet'!F114=\"\",\"\",\"LIST\")","v":"LIST"}]
[null,"E1 – 091",{"$f":"'B120-Processing sheet'!F115","v":"Please provide the grade and pipe size  of the existing stormwater pipe to be disconnected so that the adequacy of the proposed design draining the additional proposed building can be ascertained. In addition please provide the pipe grade of the proposed stormwater pipe on drawing A4. 13/07/2017 Resolved See TRIM 17/741973"},null,{"$f":"'B120-Processing sheet'!G115","v":"Resolved"}]
[null,null,{"$f":"IF('B120-Processing sheet'!F115=\"\",\"\",\"LIST\")","v":"LIST"}]
[null,"E1 – 092",{"$f":"'B120-Processing sheet'!F116","v":0},null,{"$f":"'B120-Processing sheet'!G116","v":0}]
[null,null,{"$f":"IF('B120-Processing sheet'!F116=\"\",\"\",\"LIST\")","v":""}]
[null,"E1 – 093",{"$f":"'B120-Processing sheet'!F117","v":0},null,{"$f":"'B120-Processing sheet'!G117","v":0}]
[null,null,{"$f":"IF('B120-Processing sheet'!F117=\"\",\"\",\"LIST\")","v":""}]
[null,"E1 – 094",{"$f":"'B120-Processing sheet'!F118","v":0},null,{"$f":"'B120-Processing sheet'!G118","v":0}]
[null,null,{"$f":"IF('B120-Processing sheet'!F118=\"\",\"\",\"LIST\")","v":""}]
[null,"E1 – 095",{"$f":"'B120-Processing sheet'!F119","v":"Please provide the size of the proposed overflows on drawing A19  13/07/2017 Resolved See TRIM 17/741973"},null,{"$f":"'B120-Processing sheet'!G119","v":"Resolved"}]
[null,null,{"$f":"IF('B120-Processing sheet'!F119=\"\",\"\",\"LIST\")","v":"LIST"}]
[null,"E2 – 096",{"$f":"'B120-Processing sheet'!F121","v":0},null,{"$f":"'B120-Processing sheet'!G121","v":0}]
[null,null,{"$f":"IF('B120-Processing sheet'!F121=\"\",\"\",\"LIST\")","v":""}]
[null,"E2 – 097",{"$f":"'B120-Processing sheet'!F122","v":0},null,{"$f":"'B120-Processing sheet'!G122","v":0}]
[null,null,{"$f":"IF('B120-Processing sheet'!F122=\"\",\"\",\"LIST\")","v":""}]
[null,"E2 – 098",{"$f":"'B120-Processing sheet'!F123","v":"Please note on elevations the surface finish for the blockwalls sufficient to demonstrate compliance with the requirements of E2."},null,{"$f":"'B120-Processing sheet'!G123","v":"Resolved"}]
[null,null,{"$f":"IF('B120-Processing sheet'!F123=\"\",\"\",\"LIST\")","v":"LIST"}]
[null,"E2 – 099",{"$f":"'B120-Processing sheet'!F124","v":0},null,{"$f":"'B120-Processing sheet'!G124","v":0}]
[null,null,{"$f":"IF('B120-Processing sheet'!F124=\"\",\"\",\"LIST\")","v":""}]
[null,"E2 – 100",{"$f":"'B120-Processing sheet'!F125","v":"1. Please provide cladding details for all junctions sufficient to demonstrate compliance with requirements of E2. This should include but is not limited to the vertical metal cladding to blockwall both vertical junction and internal corner and internal corner for existing metal cladding to new block wall. RESOLVED\n\n2. If it is intended to have the new element structurally seismically separate from the existing building (as identified in the structural engineers design features report), please provide details for the junctions between the new and existing walls sufficient to demonstrate compliance with the requirements of E2.\n\n13/07/17 - Thank you for the additional details. Please review detail 23 Sheet A22. It appears the existing metal wall cladding is shown as continuous within the seismic gap required. Also Detail 24 same sheet indicates the presence of blocking within this seismic gap. Please remove from details to ensure full depth of seismic separation is maintained. RESOLVED\n\n13/07/17 - NEW - please provide a detail for the junction between existing block wall and new blockwall located on the boundary - this detail should reflect the requirement for seismic separation that has been indicated throughout consent documents. Note detail 7 will need to be revised to reflect this requirement and to remove the metal cladding indicated within the seismic gap.\n\n02/08/17 - Thank you for the details provided, however please review detail 28 sheet A22. The gap between the new and existing blockwall is shown to be only 10mm, whereas there is a requirement for 50mm seismic separation. As these are both structural elements the 50mm separation is required to be maintained in this location. Note that as the gap will now exceed 0.1m² (3.5x0.050m) this gap will need to be firerated to the same rating as the wall which is shown to be 120 minute FRR."},null,{"$f":"'B120-Processing sheet'!G125","v":"Resolved"}]
[null,null,{"$f":"IF('B120-Processing sheet'!F125=\"\",\"\",\"LIST\")","v":"LIST"}]
[null,"E2 – 101",{"$f":"'B120-Processing sheet'!F126","v":0},null,{"$f":"'B120-Processing sheet'!G126","v":0}]
[null,null,{"$f":"IF('B120-Processing sheet'!F126=\"\",\"\",\"LIST\")","v":""}]
[null,"E2 – 102",{"$f":"'B120-Processing sheet'!F128","v":0},null,{"$f":"'B120-Processing sheet'!G128","v":0}]
[null,null,{"$f":"IF('B120-Processing sheet'!F128=\"\",\"\",\"LIST\")","v":""}]
[null,"E2 – 103",{"$f":"'B120-Processing sheet'!F129","v":"1. Please provide apron flashing detail for where existing vertical metal wall cladding junctions with new metal roof cladding sufficient to demonstrate compliance with the requirements of E2 and taking into consideration the seismic separation of the new and existing building if appropriate.\n\n2. Please provide rainwater head penetration detail sufficient to demonstrate compliance with the requirements of E2.\n\n3. The North elevation indicates the potential for a clash between the existing external steel (braced) poles and the eave to the east elevation. Please provide sufficient detail to demonstrate compliance with the requirements of E2 at this location."},null,{"$f":"'B120-Processing sheet'!G129","v":"Resolved"}]
[null,null,{"$f":"IF('B120-Processing sheet'!F129=\"\",\"\",\"LIST\")","v":"LIST"}]
[null,"E2 – 104",{"$f":"'B120-Processing sheet'!F130","v":"1. Please provide wall to soffit junction for the raking soffit (greater than 90 degree eave) sufficient to demonstrate compliance with the requirements of E2.\n\n2. Please provide barge detail for junction with both blockwall and vertical metal wall cladding sufficient to demonstrate compliance with the requirements of E2."},null,{"$f":"'B120-Processing sheet'!G130","v":"Resolved"}]
[null,null,{"$f":"IF('B120-Processing sheet'!F130=\"\",\"\",\"LIST\")","v":"LIST"}]
[null,"E2 – 105",{"$f":"'B120-Processing sheet'!F131","v":0},null,{"$f":"'B120-Processing sheet'!G131","v":0}]
[null,null,{"$f":"IF('B120-Processing sheet'!F131=\"\",\"\",\"LIST\")","v":""}]
[null,"E2 – 106",{"$f":"'B120-Processing sheet'!F132","v":0},null,{"$f":"'B120-Processing sheet'!G132","v":0}]
[null,null,{"$f":"IF('B120-Processing sheet'!F132=\"\",\"\",\"LIST\")","v":""}]
[null,"E2 – 107",{"$f":"'B120-Processing sheet'!F133","v":0},null,{"$f":"'B120-Processing sheet'!G133","v":0}]
[null,null,{"$f":"IF('B120-Processing sheet'!F133=\"\",\"\",\"LIST\")","v":""}]
[null,"E2 – 108",{"$f":"'B120-Processing sheet'!F134","v":"Please provide internal gutter detail which indicates extent and all material layers sufficient to demonstrate compliance with the requirements of E2."},null,{"$f":"'B120-Processing sheet'!G134","v":"Resolved"}]
[null,null,{"$f":"IF('B120-Processing sheet'!F134=\"\",\"\",\"LIST\")","v":"LIST"}]
[null,"E2 – 109",{"$f":"'B120-Processing sheet'!F135","v":"1. Please review skylight penetration detail A sheet A20. It appears to reflect skylight located near roof edge (barge) which is not applicable for this application. The drawings appear to suggest the use of a diverter/cricket flashing which there has been no details provided.\n\n2. Please provide pipe roof penetration detail for the terminal vent pentration indicated on sheet A19 sufficient to demonstrate compliance with the requirements of E2."},null,{"$f":"'B120-Processing sheet'!G135","v":"Resolved"}]
[null,null,{"$f":"IF('B120-Processing sheet'!F135=\"\",\"\",\"LIST\")","v":"LIST"}]
[null,"E2 – 110",{"$f":"'B120-Processing sheet'!F136","v":0},null,{"$f":"'B120-Processing sheet'!G136","v":0}]
[null,null,{"$f":"IF('B120-Processing sheet'!F136=\"\",\"\",\"LIST\")","v":""}]
[null,"E2 – 111",{"$f":"'B120-Processing sheet'!F137","v":0},null,{"$f":"'B120-Processing sheet'!G137","v":0}]
[null,null,{"$f":"IF('B120-Processing sheet'!F137=\"\",\"\",\"LIST\")","v":""}]
[null,"E2 – 112",{"$f":"'B120-Processing sheet'!F138","v":0},null,{"$f":"'B120-Processing sheet'!G138","v":0}]
[null,null,{"$f":"IF('B120-Processing sheet'!F138=\"\",\"\",\"LIST\")","v":""}]
[null,"E2 – 113",{"$f":"'B120-Processing sheet'!F139","v":0},null,{"$f":"'B120-Processing sheet'!G139","v":0}]
[null,null,{"$f":"IF('B120-Processing sheet'!F139=\"\",\"\",\"LIST\")","v":""}]
[null,"E2 – 114",{"$f":"'B120-Processing sheet'!F140","v":"1. Please confirm that the membrane extends beyond the blockwall window sill sufficient to demonstrate compliance with the requirements of E2.\n\n2. Please review the head flashing detail for the block wall penetrations sufficient to demonstrate compliance with the requirements of E2. ie no drip edge provided."},null,{"$f":"'B120-Processing sheet'!G140","v":"Resolved"}]
[null,null,{"$f":"IF('B120-Processing sheet'!F140=\"\",\"\",\"LIST\")","v":"LIST"}]
[null,"E2 – 115",{"$f":"'B120-Processing sheet'!F141","v":0},null,{"$f":"'B120-Processing sheet'!G141","v":0}]
[null,null,{"$f":"IF('B120-Processing sheet'!F141=\"\",\"\",\"LIST\")","v":""}]
[null,"E3 – 116",{"$f":"'B120-Processing sheet'!F143","v":0},null,{"$f":"'B120-Processing sheet'!G143","v":0}]
[null,null,{"$f":"IF('B120-Processing sheet'!F143=\"\",\"\",\"LIST\")","v":""}]
[null,"E3 – 117",{"$f":"'B120-Processing sheet'!F144","v":0},null,{"$f":"'B120-Processing sheet'!G144","v":0}]
[null,null,{"$f":"IF('B120-Processing sheet'!F144=\"\",\"\",\"LIST\")","v":""}]
[null,"E3 – 118",{"$f":"'B120-Processing sheet'!F145","v":0},null,{"$f":"'B120-Processing sheet'!G145","v":0}]
[null,null,{"$f":"IF('B120-Processing sheet'!F145=\"\",\"\",\"LIST\")","v":""}]
[null,"E3 – 119",{"$f":"'B120-Processing sheet'!F146","v":0},null,{"$f":"'B120-Processing sheet'!G146","v":0}]
[null,null,{"$f":"IF('B120-Processing sheet'!F146=\"\",\"\",\"LIST\")","v":""}]
[null,"F1 – 120",{"$f":"'B120-Processing sheet'!F148","v":0},null,{"$f":"'B120-Processing sheet'!$G$148","v":0}]
[null,null,{"$f":"IF('B120-Processing sheet'!F148=\"\",\"\",\"LIST\")","v":""}]
[null,"F2 – 121",{"$f":"'B120-Processing sheet'!F150","v":0},null,{"$f":"'B120-Processing sheet'!G150","v":0}]
[null,null,{"$f":"IF('B120-Processing sheet'!F150=\"\",\"\",\"LIST\")","v":""}]
[null,"F2 – 122",{"$f":"'B120-Processing sheet'!F151","v":"Please confirm the presence of manifestation to glazing panels capable of being mistaken for an unimpeded path sufficient to demonstrate compliance with the requirements of F2 ie side panels for sliding doors."},null,{"$f":"'B120-Processing sheet'!G151","v":"Resolved"}]
[null,null,{"$f":"IF('B120-Processing sheet'!F151=\"\",\"\",\"LIST\")","v":"LIST"}]
[null,"F2 – 123",{"$f":"'B120-Processing sheet'!F152","v":0},null,{"$f":"'B120-Processing sheet'!G152","v":0}]
[null,null,{"$f":"IF('B120-Processing sheet'!F152=\"\",\"\",\"LIST\")","v":""}]
[null,"F3 – 124",{"$f":"'B120-Processing sheet'!F154","v":"Please advise if it is intended to store or use any hazardous substances within this new building element, if so please provide sufficient documentation to demonstrate compliance with the requirements of F3."},null,{"$f":"'B120-Processing sheet'!G154","v":"Resolved"}]
[null,null,{"$f":"IF('B120-Processing sheet'!F154=\"\",\"\",\"LIST\")","v":"LIST"}]
[null,"F3 – 125",{"$f":"'B120-Processing sheet'!F155","v":0},null,{"$f":"'B120-Processing sheet'!G155","v":0}]
[null,null,{"$f":"IF('B120-Processing sheet'!F155=\"\",\"\",\"LIST\")","v":""}]
[null,"F4 – 126",{"$f":"'B120-Processing sheet'!F157","v":0},null,{"$f":"'B120-Processing sheet'!G157","v":0}]
[null,null,{"$f":"IF('B120-Processing sheet'!F157=\"\",\"\",\"LIST\")","v":""}]
[null,"F4 – 127",{"$f":"'B120-Processing sheet'!F158","v":0},null,{"$f":"'B120-Processing sheet'!G158","v":0}]
[null,null,{"$f":"IF('B120-Processing sheet'!F158=\"\",\"\",\"LIST\")","v":""}]
[null,"F4 – 128",{"$f":"'B120-Processing sheet'!F159","v":0},null,{"$f":"'B120-Processing sheet'!G159","v":0}]
[null,null,{"$f":"IF('B120-Processing sheet'!F159=\"\",\"\",\"LIST\")","v":""}]
[null,"F5 – 129",{"$f":"'B120-Processing sheet'!F161","v":"Council records indicate the presence of other properties (businesses) within this complex which are likely to continue operating during the construction of the addition. Please provide details of barriers that will be provided to protect the public and restrict access sufficient to demonstrate compliance with the requirements of F5.\n\n13/07/17 - thank you for the response, however there is insufficient information to demonstrate protection of the public during works. Please show on drawings the presence of barrier fencing sufficient to prevent public access to site during construction."},null,{"$f":"'B120-Processing sheet'!$G$161","v":"Resolved"}]
[null,null,{"$f":"IF('B120-Processing sheet'!F161=\"\",\"\",\"LIST\")","v":"LIST"}]
[null,"F6 – 130",{"$f":"'B120-Processing sheet'!F163","v":0},null,{"$f":"'B120-Processing sheet'!$G$163","v":0}]
[null,null,{"$f":"IF('B120-Processing sheet'!F163=\"\",\"\",\"LIST\")","v":""}]
[null,"F7 – 131",{"$f":"'B120-Processing sheet'!F165","v":0},null,{"$f":"'B120-Processing sheet'!$G$165","v":0}]
[null,null,{"$f":"IF('B120-Processing sheet'!F165=\"\",\"\",\"LIST\")","v":""}]
[null,"F8 – 132",{"$f":"'B120-Processing sheet'!F167","v":0},null,{"$f":"'B120-Processing sheet'!G167","v":0}]
[null,null,{"$f":"IF('B120-Processing sheet'!F167=\"\",\"\",\"LIST\")","v":""}]
[null,"F8 – 133",{"$f":"'B120-Processing sheet'!F168","v":0},null,{"$f":"'B120-Processing sheet'!G168","v":0}]
[null,null,{"$f":"IF('B120-Processing sheet'!F168=\"\",\"\",\"LIST\")","v":""}]
[null,"F8 – 134",{"$f":"'B120-Processing sheet'!F169","v":0},null,{"$f":"'B120-Processing sheet'!G169","v":0}]
[null,null,{"$f":"IF('B120-Processing sheet'!F169=\"\",\"\",\"LIST\")","v":""}]
[null,"G1 – 135",{"$f":"'B120-Processing sheet'!F171","v":0},null,{"$f":"'B120-Processing sheet'!G171","v":0}]
[null,null,{"$f":"IF('B120-Processing sheet'!F171=\"\",\"\",\"LIST\")","v":""}]
[null,"G1 – 136",{"$f":"'B120-Processing sheet'!F172","v":0},null,{"$f":"'B120-Processing sheet'!G172","v":0}]
[null,null,{"$f":"IF('B120-Processing sheet'!F172=\"\",\"\",\"LIST\")","v":""}]
[null,"G1 – 137",{"$f":"'B120-Processing sheet'!F173","v":0},null,{"$f":"'B120-Processing sheet'!G173","v":0}]
[null,null,{"$f":"IF('B120-Processing sheet'!F173=\"\",\"\",\"LIST\")","v":""}]
[null,"G1 – 138",{"$f":"'B120-Processing sheet'!F174","v":0},null,{"$f":"'B120-Processing sheet'!G174","v":0}]
[null,null,{"$f":"IF('B120-Processing sheet'!F174=\"\",\"\",\"LIST\")","v":""}]
[null,"G2 – 139",{"$f":"'B120-Processing sheet'!F176","v":0},null,{"$f":"'B120-Processing sheet'!$G$176","v":0}]
[null,null,{"$f":"IF('B120-Processing sheet'!F176=\"\",\"\",\"LIST\")","v":""}]
[null,"G3 – 140",{"$f":"'B120-Processing sheet'!F178","v":0},null,{"$f":"'B120-Processing sheet'!G178","v":0}]
[null,null,{"$f":"IF('B120-Processing sheet'!F178=\"\",\"\",\"LIST\")","v":""}]
[null,"G3 – 141",{"$f":"'B120-Processing sheet'!F179","v":0},null,{"$f":"'B120-Processing sheet'!G179","v":0}]
[null,null,{"$f":"IF('B120-Processing sheet'!F179=\"\",\"\",\"LIST\")","v":""}]
[null,"G3 – 142",{"$f":"'B120-Processing sheet'!F180","v":0},null,{"$f":"'B120-Processing sheet'!G180","v":0}]
[null,null,{"$f":"IF('B120-Processing sheet'!F180=\"\",\"\",\"LIST\")","v":""}]
[null,"G3 – 143",{"$f":"'B120-Processing sheet'!F181","v":0},null,{"$f":"'B120-Processing sheet'!G181","v":0}]
[null,null,{"$f":"IF('B120-Processing sheet'!F181=\"\",\"\",\"LIST\")","v":""}]
[null,"G3 – 144",{"$f":"'B120-Processing sheet'!F182","v":0},null,{"$f":"'B120-Processing sheet'!G182","v":0}]
[null,null,{"$f":"IF('B120-Processing sheet'!F182=\"\",\"\",\"LIST\")","v":""}]
[null,"G4 – 145",{"$f":"'B120-Processing sheet'!F184","v":0},null,{"$f":"'B120-Processing sheet'!G184","v":0}]
[null,null,{"$f":"IF('B120-Processing sheet'!F184=\"\",\"\",\"LIST\")","v":""}]
[null,"G4 – 146",{"$f":"'B120-Processing sheet'!F185","v":0},null,{"$f":"'B120-Processing sheet'!G185","v":0}]
[null,null,{"$f":"IF('B120-Processing sheet'!F185=\"\",\"\",\"LIST\")","v":""}]
[null,"G4 – 147",{"$f":"'B120-Processing sheet'!F186","v":0},null,{"$f":"'B120-Processing sheet'!G186","v":0}]
[null,null,{"$f":"IF('B120-Processing sheet'!F186=\"\",\"\",\"LIST\")","v":""}]
[null,"G4 – 148",{"$f":"'B120-Processing sheet'!F187","v":0},null,{"$f":"'B120-Processing sheet'!G187","v":0}]
[null,null,{"$f":"IF('B120-Processing sheet'!F187=\"\",\"\",\"LIST\")","v":""}]
[null,"G4 – 149",{"$f":"'B120-Processing sheet'!F188","v":0},null,{"$f":"'B120-Processing sheet'!G188","v":0}]
[null,null,{"$f":"IF('B120-Processing sheet'!F188=\"\",\"\",\"LIST\")","v":""}]
[null,"G5 – 150",{"$f":"'B120-Processing sheet'!F190","v":0},null,{"$f":"'B120-Processing sheet'!G190","v":0}]
[null,null,{"$f":"IF('B120-Processing sheet'!F190=\"\",\"\",\"LIST\")","v":""}]
[null,"G5 – 151",{"$f":"'B120-Processing sheet'!F191","v":0},null,{"$f":"'B120-Processing sheet'!G191","v":0}]
[null,null,{"$f":"IF('B120-Processing sheet'!F191=\"\",\"\",\"LIST\")","v":""}]
[null,"G5 – 152",{"$f":"'B120-Processing sheet'!F192","v":0},null,{"$f":"'B120-Processing sheet'!G192","v":0}]
[null,null,{"$f":"IF('B120-Processing sheet'!F192=\"\",\"\",\"LIST\")","v":""}]
[null,"G6 – 153",{"$f":"'B120-Processing sheet'!F194","v":0},null,{"$f":"'B120-Processing sheet'!G194","v":0}]
[null,null,{"$f":"IF('B120-Processing sheet'!F194=\"\",\"\",\"LIST\")","v":""}]
[null,"G6 – 154",{"$f":"'B120-Processing sheet'!F195","v":0},null,{"$f":"'B120-Processing sheet'!G195","v":0}]
[null,null,{"$f":"IF('B120-Processing sheet'!F195=\"\",\"\",\"LIST\")","v":""}]
[null,"G7 – 155",{"$f":"'B120-Processing sheet'!F197","v":0},null,{"$f":"'B120-Processing sheet'!G197","v":0}]
[null,null,{"$f":"IF('B120-Processing sheet'!F197=\"\",\"\",\"LIST\")","v":""}]
[null,"G7 – 156",{"$f":"'B120-Processing sheet'!F198","v":0},null,{"$f":"'B120-Processing sheet'!G198","v":0}]
[null,null,{"$f":"IF('B120-Processing sheet'!F198=\"\",\"\",\"LIST\")","v":""}]
[null,"G8 – 157",{"$f":"'B120-Processing sheet'!F200","v":0},null,{"$f":"'B120-Processing sheet'!G200","v":0}]
[null,null,{"$f":"IF('B120-Processing sheet'!F200=\"\",\"\",\"LIST\")","v":""}]
[null,"G9 – 158",{"$f":"'B120-Processing sheet'!F202","v":0},null,{"$f":"'B120-Processing sheet'!G202","v":0}]
[null,null,{"$f":"IF('B120-Processing sheet'!F202=\"\",\"\",\"LIST\")","v":""}]
[null,"G9 – 159",{"$f":"'B120-Processing sheet'!F203","v":0},null,{"$f":"'B120-Processing sheet'!G203","v":0}]
[null,null,{"$f":"IF('B120-Processing sheet'!F203=\"\",\"\",\"LIST\")","v":""}]
[null,"G9 – 160",{"$f":"'B120-Processing sheet'!F204","v":0},null,{"$f":"'B120-Processing sheet'!G204","v":0}]
[null,null,{"$f":"IF('B120-Processing sheet'!F204=\"\",\"\",\"LIST\")","v":""}]
[null,"G10 - 161",{"$f":"'B120-Processing sheet'!F206","v":0},null,{"$f":"'B120-Processing sheet'!G206","v":0}]
[null,null,{"$f":"IF('B120-Processing sheet'!F206=\"\",\"\",\"LIST\")","v":""}]
[null,"G10 - 162",{"$f":"'B120-Processing sheet'!F207","v":"Please revise the standard referenced on sheet A8 in relation to the gas supply. The current standard for gas installation is AS/NZS5601:2013."},null,{"$f":"'B120-Processing sheet'!G207","v":"Resolved"}]
[null,null,{"$f":"IF('B120-Processing sheet'!F207=\"\",\"\",\"LIST\")","v":"LIST"}]
[null,"G12 – 163",{"$f":"'B120-Processing sheet'!F209","v":0},null,{"$f":"'B120-Processing sheet'!G209","v":0}]
[null,null,{"$f":"IF('B120-Processing sheet'!F209=\"\",\"\",\"LIST\")","v":""}]
[null,"G12 – 164",{"$f":"'B120-Processing sheet'!F210","v":0},null,{"$f":"'B120-Processing sheet'!G210","v":0}]
[null,null,{"$f":"IF('B120-Processing sheet'!F210=\"\",\"\",\"LIST\")","v":""}]
[null,"G12 – 165",{"$f":"'B120-Processing sheet'!F211","v":"Council records show this property to be industrial, however there are no records indicating the presence of backflow prevention device. The Council waters department requires all commercial properties to have a backflow prevention device at the boundary to protect the network water supply. Installation of the backflow preventor requires a building consent. Please advise if you would like to increase to scope to include the installation of a backflow prevention device, if so all supporting documentation identifying type and model will also be required."},null,{"$f":"'B120-Processing sheet'!G211","v":"Resolved"}]
[null,null,{"$f":"IF('B120-Processing sheet'!F211=\"\",\"\",\"LIST\")","v":"LIST"}]
[null,"G12 – 166",{"$f":"'B120-Processing sheet'!F212","v":0},null,{"$f":"'B120-Processing sheet'!G212","v":0}]
[null,null,{"$f":"IF('B120-Processing sheet'!F212=\"\",\"\",\"LIST\")","v":""}]
[null,"G12 – 167",{"$f":"'B120-Processing sheet'!F213","v":0},null,{"$f":"'B120-Processing sheet'!G213","v":0}]
[null,null,{"$f":"IF('B120-Processing sheet'!F213=\"\",\"\",\"LIST\")","v":""}]
[null,"G12 – 168",{"$f":"'B120-Processing sheet'!F214","v":0},null,{"$f":"'B120-Processing sheet'!G214","v":0}]
[null,null,{"$f":"IF('B120-Processing sheet'!F214=\"\",\"\",\"LIST\")","v":""}]
[null,"G12 – 169",{"$f":"'B120-Processing sheet'!F215","v":0},null,{"$f":"'B120-Processing sheet'!G215","v":0}]
[null,null,{"$f":"IF('B120-Processing sheet'!F215=\"\",\"\",\"LIST\")","v":""}]
[null,"G13 – 170",{"$f":"'B120-Processing sheet'!F217","v":"Please review the plumbing design taking into consideration that AS3500 requires all drains within slabs to be minimum of 65mm diameter."},null,{"$f":"'B120-Processing sheet'!G217","v":"Resolved"}]
[null,null,{"$f":"IF('B120-Processing sheet'!F217=\"\",\"\",\"LIST\")","v":"LIST"}]
[null,"G13 – 171",{"$f":"'B120-Processing sheet'!F218","v":"1. The plumbing plan indicates the presence of two existing inspection bends (IB) for the existing sewer pipe. Please review the requirement and if necessary provide sufficient details to demonstrate that these can be maintained to demonstrate compliance with the requirements of AS3500.\n\n2. Please review the location of inspection points for the existing wastewater connection - note at least one required outside the edge of building."},null,{"$f":"'B120-Processing sheet'!G218","v":"Resolved"}]
[null,null,{"$f":"IF('B120-Processing sheet'!F218=\"\",\"\",\"LIST\")","v":"LIST"}]
[null,"G13 – 172",{"$f":"'B120-Processing sheet'!F219","v":"Please provide sufficient information to demonstrate compliance with the requirements of AS3500 in relation to implications of trenches close to building and drains under buildings."},null,{"$f":"'B120-Processing sheet'!G219","v":"Resolved"}]
[null,null,{"$f":"IF('B120-Processing sheet'!F219=\"\",\"\",\"LIST\")","v":"LIST"}]
[null,"G13 – 173",{"$f":"'B120-Processing sheet'!F220","v":0},null,{"$f":"'B120-Processing sheet'!G220","v":0}]
[null,null,{"$f":"IF('B120-Processing sheet'!F220=\"\",\"\",\"LIST\")","v":""}]
[null,"G13 – 174",{"$f":"'B120-Processing sheet'!F221","v":0},null,{"$f":"'B120-Processing sheet'!G221","v":0}]
[null,null,{"$f":"IF('B120-Processing sheet'!F221=\"\",\"\",\"LIST\")","v":""}]
[null,"G13 – 175",{"$f":"'B120-Processing sheet'!F222","v":0},null,{"$f":"'B120-Processing sheet'!G222","v":0}]
[null,null,{"$f":"IF('B120-Processing sheet'!F222=\"\",\"\",\"LIST\")","v":""}]
[null,"G13 – 176",{"$f":"'B120-Processing sheet'!F223","v":0},null,{"$f":"'B120-Processing sheet'!G223","v":0}]
[null,null,{"$f":"IF('B120-Processing sheet'!F223=\"\",\"\",\"LIST\")","v":""}]
[null,"G14 – 177",{"$f":"'B120-Processing sheet'!F225","v":0},null,{"$f":"'B120-Processing sheet'!G225","v":0}]
[null,null,{"$f":"IF('B120-Processing sheet'!F225=\"\",\"\",\"LIST\")","v":""}]
[null,"G15 – 178",{"$f":"'B120-Processing sheet'!F227","v":0},null,{"$f":"'B120-Processing sheet'!G227","v":0}]
[null,null,{"$f":"IF('B120-Processing sheet'!F227=\"\",\"\",\"LIST\")","v":""}]
[null,"H1 – 179",{"$f":"'B120-Processing sheet'!F229","v":0},null,{"$f":"'B120-Processing sheet'!G229","v":0}]
[null,null,{"$f":"IF('B120-Processing sheet'!F229=\"\",\"\",\"LIST\")","v":""}]
[null,"H1 – 180",{"$f":"'B120-Processing sheet'!F230","v":"1. Please provide details of the extent of conditioned space for the new addition taking into consideration the opening between the new and existing building sufficient to demonstrate compliance with the requirements of H1.\n\n2. Please review the H1 calculations provided. The reference heat loss for the vertical glazing appears excessive in relation to the proposed vertical glazing."},null,{"$f":"'B120-Processing sheet'!G230","v":"Resolved"}]
[null,null,{"$f":"IF('B120-Processing sheet'!F230=\"\",\"\",\"LIST\")","v":"LIST"}]
[null,"H1 – 181",{"$f":"'B120-Processing sheet'!F231","v":0},null,{"$f":"'B120-Processing sheet'!G231","v":0}]
[null,null,{"$f":"IF('B120-Processing sheet'!F231=\"\",\"\",\"LIST\")","v":""}]
[null,"H1 – 182",{"$f":"'B120-Processing sheet'!F232","v":0},null,{"$f":"'B120-Processing sheet'!G232","v":0}]
[null,null,{"$f":"IF('B120-Processing sheet'!F232=\"\",\"\",\"LIST\")","v":""}]
[null,"CS - 183",{"$f":"'B120-Processing sheet'!F234","v":0},null,{"$f":"'B120-Processing sheet'!G234","v":0}]
[null,null,{"$f":"IF('B120-Processing sheet'!F234=\"\",\"\",\"LIST\")","v":""}]
[null,"CS  - 184",{"$f":"'B120-Processing sheet'!F235","v":0},null,{"$f":"'B120-Processing sheet'!G235","v":0}]
[null,null,{"$f":"IF('B120-Processing sheet'!F235=\"\",\"\",\"LIST\")","v":""}]
[null,"CM - 185",{"$f":"'B120-Processing sheet'!F237","v":0},null,{"$f":"'B120-Processing sheet'!G237","v":0}]
[null,null,{"$f":"IF('B120-Processing sheet'!F237=\"\",\"\",\"LIST\")","v":""}]
[null,"CM - 186",{"$f":"'B120-Processing sheet'!F238","v":0},null,{"$f":"'B120-Processing sheet'!G238","v":0}]
[null,null,{"$f":"IF('B120-Processing sheet'!F238=\"\",\"\",\"LIST\")","v":""}]
[null,"OT - 187",{"$f":"'B120-Processing sheet'!F240","v":0},null,{"$f":"'B120-Processing sheet'!G240","v":0}]
[null,null,{"$f":"IF('B120-Processing sheet'!F240=\"\",\"\",\"LIST\")","v":""}]
[null,"OT - 188",{"$f":"'B120-Processing sheet'!F241","v":0},null,{"$f":"'B120-Processing sheet'!G241","v":0}]
[null,null,{"$f":"IF('B120-Processing sheet'!F241=\"\",\"\",\"LIST\")","v":""}]
[null,"HAZ - 001",{"$f":"'S71-74 natural hazards'!$F$18","v":0},null,{"$f":"'S71-74 natural hazards'!$G$18","v":0}]
[null,null,{"$f":"IF('S71-74 natural hazards'!F18=\"\",\"\",\"LIST\")","v":""}]
[null,"HAZ - 002",{"$f":"'S71-74 natural hazards'!$F$19","v":0},null,{"$f":"'S71-74 natural hazards'!$G$19","v":0}]
[null,null,{"$f":"IF('S71-74 natural hazards'!F19=\"\",\"\",\"LIST\")","v":""}]
[null,"HAZ - 003",{"$f":"'S71-74 natural hazards'!$F$20","v":0},null,{"$f":"'S71-74 natural hazards'!$G$20","v":0}]
[null,null,{"$f":"IF('S71-74 natural hazards'!F20=\"\",\"\",\"LIST\")","v":""}]
[null,"HAZ - 004",{"$f":"'S71-74 natural hazards'!$F$21","v":0},null,{"$f":"'S71-74 natural hazards'!$G$21","v":0}]
[null,null,{"$f":"IF('S71-74 natural hazards'!F21=\"\",\"\",\"LIST\")","v":""}]
[null,"HAZ - 005",{"$f":"'S71-74 natural hazards'!$F$22","v":0},null,{"$f":"'S71-74 natural hazards'!$G$22","v":0}]
[null,null,{"$f":"IF('S71-74 natural hazards'!F22=\"\",\"\",\"LIST\")","v":""}]
[null,"HAZ - 006",{"$f":"'S71-74 natural hazards'!$F$23","v":0},null,{"$f":"'S71-74 natural hazards'!$G$23","v":0}]
[null,null,{"$f":"IF('S71-74 natural hazards'!F23=\"\",\"\",\"LIST\")","v":""}]
[null,"HAZ - 007",{"$f":"'S71-74 natural hazards'!$F$24","v":0},null,{"$f":"'S71-74 natural hazards'!$G$24","v":0}]
[null,null,{"$f":"IF('S71-74 natural hazards'!F24=\"\",\"\",\"LIST\")","v":""}]
[null,"HAZ - 008",{"$f":"'S71-74 natural hazards'!$F$25","v":0},null,{"$f":"'S71-74 natural hazards'!$G$25","v":0}]
[null,null,{"$f":"IF('S71-74 natural hazards'!F25=\"\",\"\",\"LIST\")","v":""}]
[null,"HAZ - 009",{"$f":"'S71-74 natural hazards'!$F$26","v":0},null,{"$f":"'S71-74 natural hazards'!$G$26","v":0}]
[null,null,{"$f":"IF('S71-74 natural hazards'!F26=\"\",\"\",\"LIST\")","v":""}]
[null,"HAZ - 010",{"$f":"'S71-74 natural hazards'!$F$27","v":0},null,{"$f":"'S71-74 natural hazards'!$G$27","v":0}]
[null,null,{"$f":"IF('S71-74 natural hazards'!F27=\"\",\"\",\"LIST\")","v":""}]
[null,null,{"$f":"IF('B150-Structural specialist '!K24>1,'B150-Structural specialist '!L28,\"\")","v":"Specialist Review : Geotechnical  (Margaret Stoffel)"}]
[null,"GEO - 001",{"$f":"'B150-Structural specialist '!F22","v":"a) please provide Engco geotechnical report for 83 Byron St. ADDED 13/7/17 report not provided; please provide ENGCO report. ADDED 31/7/17: Please provide results of CPT and CPTu site investigation. RESOLVED 15/8/17\n\na2) ADDED 31/7/17: The Engco report for 83 Byron St indicates potential liquefaction induced settlement up to 100mm for SLS and up to 165mm for ULS are possible. Please clarify that this has been considered in design of the slab footing for 80 Byron St extension. 15/8/17: WITHDRAWN\n\nb) Please compare foundation for existing building to the foundation for the proposed extension since the two will be structurally connected. WITHDRAWN  13/7/17\n\nc) Specification section 2.4.1 Excavation states: “Below slabs on ground the general intent is to excavate to a stable undisturbed subgrade (of 300kPa ultimate bearing capacity).” This is inconsistent with the PS1 and the geotechnical letter which indicate the foundation was designed for a safe bearing of 50kPa (which I understand to be equivalent to an ultimate bearing capacity of 150kPa which was recommended by the geotechnical letter). Please amend specification. RESOLVED 13/7/2013\n\nd) Specification section 2.4.1 Excavation also states “As soon as excavation and filling is complete foundation material will be inspected by the Architect…”. Please amend specification for foundation subgrade to be verified by the geotechnical engineer. RESOLVED 13/7/2013\n\ne) Specification section 2.4.2 Hardfill & Blinding states “Hardfill under slabs on grade shall be 150mm of standard TNZ AP40 basecourse…”  The geotechnical letter recommends a 300mm thick layer of AP65 below the concrete slab if placed on organic fill with UBC 150kPa, with geotextile (Bidim A19 or equal) on base & sides of excavation, geogrid (Cirtex Duragrid 30/30 or equal) over the textile; extending beyond the building footprint a distance equal to the depth of the gravel. Please address why geotechnical recommendations were not followed. RESOLVED 13/7/2013\n\n"},null,{"$f":"'B150-Structural specialist '!G22","v":"RESOLVED"}]
[null,null,{"$f":"IF('B150-Structural specialist '!F22=\"\",\"\",\"LIST\")","v":"LIST"}]
[null,"GEO - 001A",{"$f":"'B150-Structural specialist '!F23","v":"f) The geotechnical letter also recommends that where it is not possible to extend the gravel layer beyond the building footprint on the South & West sides of the building because the site boundary does not does not provide adequate space, a new slab section must be designed. Please address this issue. ADDED 13/7/17: Response revers to structural calculations; this does not answer the question. Please indicate where this information is found. 31/7/17: no response provided RESOLVED 15/8/17"},null,{"$f":"'B150-Structural specialist '!G23","v":0}]
[null,null,{"$f":"IF('B150-Structural specialist '!F23=\"\",\"\",\"LIST\")","v":"LIST"}]
[null,null,{"$f":"IF('B150-Structural specialist '!K39>1,'B150-Structural specialist '!M33,\"\")","v":""}]
[null,"STR -002",{"$f":"'B150-Structural specialist '!F25","v":0},null,{"$f":"'B150-Structural specialist '!G25","v":0}]
[null,null,{"$f":"IF('B150-Structural specialist '!F25=\"\",\"\",\"LIST\")","v":""}]
[null,"STR -003",{"$f":"'B150-Structural specialist '!F26","v":0},null,{"$f":"'B150-Structural specialist '!G26","v":0}]
[null,null,{"$f":"IF('B150-Structural specialist '!F26=\"\",\"\",\"LIST\")","v":""}]
[null,"STR -004",{"$f":"'B150-Structural specialist '!F27","v":0},null,{"$f":"'B150-Structural specialist '!G27","v":0}]
[null,null,{"$f":"IF('B150-Structural specialist '!F27=\"\",\"\",\"LIST\")","v":""}]
[null,"STR -005",{"$f":"'B150-Structural specialist '!F29","v":0},null,{"$f":"'B150-Structural specialist '!G29","v":0}]
[null,null,{"$f":"IF('B150-Structural specialist '!F29=\"\",\"\",\"LIST\")","v":""}]
[null,"STR -006",{"$f":"'B150-Structural specialist '!F31","v":0},null,{"$f":"'B150-Structural specialist '!G31","v":0}]
[null,null,{"$f":"IF('B150-Structural specialist '!F31=\"\",\"\",\"LIST\")","v":""}]
[null,"STR -007",{"$f":"'B150-Structural specialist '!F32","v":0},null,{"$f":"'B150-Structural specialist '!G32","v":0}]
[null,null,{"$f":"IF('B150-Structural specialist '!F32=\"\",\"\",\"LIST\")","v":""}]
[null,"STR -008",{"$f":"'B150-Structural specialist '!F33","v":0},null,{"$f":"'B150-Structural specialist '!G33","v":0}]
[null,null,{"$f":"IF('B150-Structural specialist '!F33=\"\",\"\",\"LIST\")","v":""}]
[null,"STR -009",{"$f":"'B150-Structural specialist '!F34","v":0},null,{"$f":"'B150-Structural specialist '!G34","v":0}]
[null,null,{"$f":"IF('B150-Structural specialist '!F34=\"\",\"\",\"LIST\")","v":""}]
[null,"STR -010",{"$f":"'B150-Structural specialist '!F36","v":0},null,{"$f":"'B150-Structural specialist '!G36","v":0}]
[null,null,{"$f":"IF('B150-Structural specialist '!F36=\"\",\"\",\"LIST\")","v":""}]
[null,"STR -010A",{"$f":"'B150-Structural specialist '!F37","v":0},null,{"$f":"'B150-Structural specialist '!G37","v":0}]
[null,null,{"$f":"IF('B150-Structural specialist '!F37=\"\",\"\",\"LIST\")","v":""}]
[null,null,{"$f":"IF('B151a-Fire safety specialist'!K72>1,'B151a-Fire safety specialist'!M70,\"\")","v":"Specialist Review : Fire  (Adrienne Slattery (Jonathan Nyman from 13/7/2017))"}]
[null,"FIR - 001",{"$f":"'B151a-Fire safety specialist'!F15","v":0},null,{"$f":"'B151a-Fire safety specialist'!G15","v":0}]
[null,null,{"$f":"IF('B151a-Fire safety specialist'!F15=\"\",\"\",\"LIST\")","v":""}]
[null,"FIR - 002",{"$f":"'B151a-Fire safety specialist'!F16","v":0},null,{"$f":"'B151a-Fire safety specialist'!G16","v":0}]
[null,null,{"$f":"IF('B151a-Fire safety specialist'!F16=\"\",\"\",\"LIST\")","v":""}]
[null,"FIR - 003",{"$f":"'B151a-Fire safety specialist'!F18","v":0},null,{"$f":"'B151a-Fire safety specialist'!G18","v":0}]
[null,null,{"$f":"IF('B151a-Fire safety specialist'!F18=\"\",\"\",\"LIST\")","v":""}]
[null,"FIR - 004",{"$f":"'B151a-Fire safety specialist'!F19","v":0},null,{"$f":"'B151a-Fire safety specialist'!G19","v":0}]
[null,null,{"$f":"IF('B151a-Fire safety specialist'!F19=\"\",\"\",\"LIST\")","v":""}]
[null,"FIR - 005",{"$f":"'B151a-Fire safety specialist'!F20","v":"The existing use listed on the compliance schedule is WL FHC2 and the building in part is provided with sprinkler coverage. Please reassess the building and update the fire report to reflect the change of use occuring and specified systems within the building. We cannot amend the compliance schedule without further information provided on the sprinkler system. \nADDED 13/7/2017 - Response noted.  As previously advised the existing Compliance Schedule (CS) states the building Purpose Group as WL, and that the building has some form of sprinkler protection.  The fire design proposes the building is to be used for workshop with storage to 3m which would change the use to WM Purpose Group. Consideration of such a Change of Use, and any building deletion of sprinklers from the CS and it's impact on neighbouring property protection as applicable is required."},null,{"$f":"'B151a-Fire safety specialist'!G20","v":"Resolved"}]
[null,null,{"$f":"IF('B151a-Fire safety specialist'!F20=\"\",\"\",\"LIST\")","v":"LIST"}]
[null,"FIR - 006",{"$f":"'B151a-Fire safety specialist'!F21","v":0},null,{"$f":"'B151a-Fire safety specialist'!G21","v":0}]
[null,null,{"$f":"IF('B151a-Fire safety specialist'!F21=\"\",\"\",\"LIST\")","v":""}]
[null,"FIR - 007",{"$f":"'B151a-Fire safety specialist'!F22","v":0},null,{"$f":"'B151a-Fire safety specialist'!G22","v":0}]
[null,null,{"$f":"IF('B151a-Fire safety specialist'!F22=\"\",\"\",\"LIST\")","v":""}]
[null,"FIR - 008",{"$f":"'B151a-Fire safety specialist'!F23","v":0},null,{"$f":"'B151a-Fire safety specialist'!G23","v":0}]
[null,null,{"$f":"IF('B151a-Fire safety specialist'!F23=\"\",\"\",\"LIST\")","v":""}]
[null,"FIR - 009",{"$f":"'B151a-Fire safety specialist'!F24","v":0},null,{"$f":"'B151a-Fire safety specialist'!G24","v":0}]
[null,null,{"$f":"IF('B151a-Fire safety specialist'!F24=\"\",\"\",\"LIST\")","v":""}]
[null,"FIR - 010",{"$f":"'B151a-Fire safety specialist'!F25","v":"As this application meets the criteria in NEW ZEALAND GAZETTE, No. 49  under 'Notice that Copies of Certain Applications for Building Consent Must be Provided to the New Zealand Fire Service Commission', the application has been sent to NZFS for them to provide a memorandum in accordance with section 47 of the Building Act. Once we receive their memorandum we will give regard to the memorandum and send to you for your response.\nADDED 21/04/2017 Please address the issues raised in the attached memo from the NZFS. \nADDED 13/7/2017 - Response to NZFS DRU memo, issued 21/4/2017, is still awaited. Memo is re-attached for use."},null,{"$f":"'B151a-Fire safety specialist'!G25","v":"Resolved"}]
[null,null,{"$f":"IF('B151a-Fire safety specialist'!F25=\"\",\"\",\"LIST\")","v":"LIST"}]
[null,"FIR - 011",{"$f":"'B151a-Fire safety specialist'!F26","v":0},null,{"$f":"'B151a-Fire safety specialist'!G26","v":0}]
[null,null,{"$f":"IF('B151a-Fire safety specialist'!F26=\"\",\"\",\"LIST\")","v":""}]
[null,"FIR - 012",{"$f":"'B151a-Fire safety specialist'!F28","v":0},null,{"$f":"'B151a-Fire safety specialist'!G28","v":0}]
[null,null,{"$f":"IF('B151a-Fire safety specialist'!F28=\"\",\"\",\"LIST\")","v":""}]
[null,"FIR - 013",{"$f":"'B151a-Fire safety specialist'!F29","v":0},null,{"$f":"'B151a-Fire safety specialist'!G29","v":0}]
[null,null,{"$f":"IF('B151a-Fire safety specialist'!F29=\"\",\"\",\"LIST\")","v":""}]
[null,"FIR - 014",{"$f":"'B151a-Fire safety specialist'!F30","v":0},null,{"$f":"'B151a-Fire safety specialist'!G30","v":0}]
[null,null,{"$f":"IF('B151a-Fire safety specialist'!F30=\"\",\"\",\"LIST\")","v":""}]
[null,"FIR - 015",{"$f":"'B151a-Fire safety specialist'!F31","v":0},null,{"$f":"'B151a-Fire safety specialist'!G31","v":0}]
[null,null,{"$f":"IF('B151a-Fire safety specialist'!F31=\"\",\"\",\"LIST\")","v":""}]
[null,"FIR - 016",{"$f":"'B151a-Fire safety specialist'!F32","v":0},null,{"$f":"'B151a-Fire safety specialist'!G32","v":0}]
[null,null,{"$f":"IF('B151a-Fire safety specialist'!F32=\"\",\"\",\"LIST\")","v":""}]
[null,"FIR - 017",{"$f":"'B151a-Fire safety specialist'!F33","v":0},null,{"$f":"'B151a-Fire safety specialist'!G33","v":0}]
[null,null,{"$f":"IF('B151a-Fire safety specialist'!F33=\"\",\"\",\"LIST\")","v":""}]
[null,"FIR - 018",{"$f":"'B151a-Fire safety specialist'!F34","v":0},null,{"$f":"'B151a-Fire safety specialist'!G34","v":0}]
[null,null,{"$f":"IF('B151a-Fire safety specialist'!F34=\"\",\"\",\"LIST\")","v":""}]
[null,"FIR - 019",{"$f":"'B151a-Fire safety specialist'!F35","v":0},null,{"$f":"'B151a-Fire safety specialist'!G35","v":0}]
[null,null,{"$f":"IF('B151a-Fire safety specialist'!F35=\"\",\"\",\"LIST\")","v":""}]
[null,"FIR - 020",{"$f":"'B151a-Fire safety specialist'!F36","v":0},null,{"$f":"'B151a-Fire safety specialist'!G36","v":0}]
[null,null,{"$f":"IF('B151a-Fire safety specialist'!F36=\"\",\"\",\"LIST\")","v":""}]
[null,"FIR - 021",{"$f":"'B151a-Fire safety specialist'!F37","v":0},null,{"$f":"'B151a-Fire safety specialist'!G37","v":0}]
[null,null,{"$f":"IF('B151a-Fire safety specialist'!F37=\"\",\"\",\"LIST\")","v":""}]
[null,"FIR - 022",{"$f":"'B151a-Fire safety specialist'!F38","v":0},null,{"$f":"'B151a-Fire safety specialist'!G38","v":0}]
[null,null,{"$f":"IF('B151a-Fire safety specialist'!F38=\"\",\"\",\"LIST\")","v":""}]
[null,"FIR - 023",{"$f":"'B151a-Fire safety specialist'!F39","v":0},null,{"$f":"'B151a-Fire safety specialist'!G39","v":0}]
[null,null,{"$f":"IF('B151a-Fire safety specialist'!F39=\"\",\"\",\"LIST\")","v":""}]
[null,"FIR - 024",{"$f":"'B151a-Fire safety specialist'!F41","v":0},null,{"$f":"'B151a-Fire safety specialist'!G41","v":0}]
[null,null,{"$f":"IF('B151a-Fire safety specialist'!F41=\"\",\"\",\"LIST\")","v":""}]
[null,"FIR - 025",{"$f":"'B151a-Fire safety specialist'!F42","v":"Please provide further justification for the occupant load density for the workshop area and please update the fire report."},null,{"$f":"'B151a-Fire safety specialist'!G42","v":"Resolved"}]
[null,null,{"$f":"IF('B151a-Fire safety specialist'!F42=\"\",\"\",\"LIST\")","v":"LIST"}]
[null,"FIR - 026",{"$f":"'B151a-Fire safety specialist'!F43","v":0},null,{"$f":"'B151a-Fire safety specialist'!G43","v":0}]
[null,null,{"$f":"IF('B151a-Fire safety specialist'!F43=\"\",\"\",\"LIST\")","v":""}]
[null,"FIR - 027",{"$f":"'B151a-Fire safety specialist'!F44","v":0},null,{"$f":"'B151a-Fire safety specialist'!G44","v":0}]
[null,null,{"$f":"IF('B151a-Fire safety specialist'!F44=\"\",\"\",\"LIST\")","v":""}]
[null,"FIR - 028",{"$f":"'B151a-Fire safety specialist'!F45","v":0},null,{"$f":"'B151a-Fire safety specialist'!G45","v":0}]
[null,null,{"$f":"IF('B151a-Fire safety specialist'!F45=\"\",\"\",\"LIST\")","v":""}]
[null,"FIR - 029",{"$f":"'B151a-Fire safety specialist'!F46","v":0},null,{"$f":"'B151a-Fire safety specialist'!G46","v":0}]
[null,null,{"$f":"IF('B151a-Fire safety specialist'!F46=\"\",\"\",\"LIST\")","v":""}]
[null,"FIR - 030",{"$f":"'B151a-Fire safety specialist'!F47","v":0},null,{"$f":"'B151a-Fire safety specialist'!G47","v":0}]
[null,null,{"$f":"IF('B151a-Fire safety specialist'!F47=\"\",\"\",\"LIST\")","v":""}]
[null,"FIR - 031",{"$f":"'B151a-Fire safety specialist'!F48","v":"The fire report requirements include replacing key locks with snib locks. To demonstrate that the design is coordinated please provide a door hardware schedule as part of the architectural set of drawings. \nADDED 13/7/2017 - Fire engineer response noted.  Please provide the door schedule detailing the required new door locks to be provided for compliance."},null,{"$f":"'B151a-Fire safety specialist'!G48","v":"Resolved"}]
[null,null,{"$f":"IF('B151a-Fire safety specialist'!F48=\"\",\"\",\"LIST\")","v":"LIST"}]
[null,"FIR - 032",{"$f":"'B151a-Fire safety specialist'!F49","v":0},null,{"$f":"'B151a-Fire safety specialist'!G49","v":0}]
[null,null,{"$f":"IF('B151a-Fire safety specialist'!F49=\"\",\"\",\"LIST\")","v":""}]
[null,"FIR - 033",{"$f":"'B151a-Fire safety specialist'!F50","v":0},null,{"$f":"'B151a-Fire safety specialist'!G50","v":0}]
[null,null,{"$f":"IF('B151a-Fire safety specialist'!F50=\"\",\"\",\"LIST\")","v":""}]
[null,"FIR - 034",{"$f":"'B151a-Fire safety specialist'!F51","v":0},null,{"$f":"'B151a-Fire safety specialist'!G51","v":0}]
[null,null,{"$f":"IF('B151a-Fire safety specialist'!F51=\"\",\"\",\"LIST\")","v":""}]
[null,"FIR - 035",{"$f":"'B151a-Fire safety specialist'!F52","v":0},null,{"$f":"'B151a-Fire safety specialist'!G52","v":0}]
[null,null,{"$f":"IF('B151a-Fire safety specialist'!F52=\"\",\"\",\"LIST\")","v":""}]
[null,"FIR - 036",{"$f":"'B151a-Fire safety specialist'!F53","v":0},null,{"$f":"'B151a-Fire safety specialist'!G53","v":0}]
[null,null,{"$f":"IF('B151a-Fire safety specialist'!F53=\"\",\"\",\"LIST\")","v":""}]
[null,"FIR - 037",{"$f":"'B151a-Fire safety specialist'!F54","v":"The fire report states that the wall and ceiling linings in the new office extension is painted plasterboard, however it appears that plywood is noted. Please update the fire report / architectural plans as applicable to demonstrate that the design has been coordinated. "},null,{"$f":"'B151a-Fire safety specialist'!G54","v":"Resolved"}]
[null,null,{"$f":"IF('B151a-Fire safety specialist'!F54=\"\",\"\",\"LIST\")","v":"LIST"}]
[null,"FIR - 038",{"$f":"'B151a-Fire safety specialist'!F55","v":0},null,{"$f":"'B151a-Fire safety specialist'!G55","v":0}]
[null,null,{"$f":"IF('B151a-Fire safety specialist'!F55=\"\",\"\",\"LIST\")","v":""}]
[null,"FIR - 039",{"$f":"'B151a-Fire safety specialist'!F56","v":0},null,{"$f":"'B151a-Fire safety specialist'!G56","v":0}]
[null,null,{"$f":"IF('B151a-Fire safety specialist'!F56=\"\",\"\",\"LIST\")","v":""}]
[null,"FIR - 040",{"$f":"'B151a-Fire safety specialist'!F57","v":0},null,{"$f":"'B151a-Fire safety specialist'!G57","v":0}]
[null,null,{"$f":"IF('B151a-Fire safety specialist'!F57=\"\",\"\",\"LIST\")","v":""}]
[null,"FIR - 041",{"$f":"'B151a-Fire safety specialist'!F59","v":0},null,{"$f":"'B151a-Fire safety specialist'!G59","v":0}]
[null,null,{"$f":"IF('B151a-Fire safety specialist'!F59=\"\",\"\",\"LIST\")","v":""}]
[null,"FIR - 042",{"$f":"'B151a-Fire safety specialist'!F60","v":0},null,{"$f":"'B151a-Fire safety specialist'!G60","v":0}]
[null,null,{"$f":"IF('B151a-Fire safety specialist'!F60=\"\",\"\",\"LIST\")","v":""}]
[null,"FIR - 043",{"$f":"'B151a-Fire safety specialist'!F61","v":0},null,{"$f":"'B151a-Fire safety specialist'!G61","v":0}]
[null,null,{"$f":"IF('B151a-Fire safety specialist'!F61=\"\",\"\",\"LIST\")","v":""}]
[null,"FIR - 044",{"$f":"'B151a-Fire safety specialist'!F62","v":"Please provide an emergency lighting design to demonstrate compliance with F6 of NZ Building Code as required in the Fire report. Please refer to paragraph 1.7 of F6/AS1 for the documentation you need to supply. Please provide full technical justification of the design and a PS1 from a CPEng engineer with assessed area being electrical engineering, or from a professional lighting consultant. \nADDED 13/7/2017 - Query outstanding"},null,{"$f":"'B151a-Fire safety specialist'!G62","v":"Resolved"}]
[null,null,{"$f":"IF('B151a-Fire safety specialist'!F62=\"\",\"\",\"LIST\")","v":"LIST"}]
[null,"FIR - 045",{"$f":"'B151a-Fire safety specialist'!F63","v":0},null,{"$f":"'B151a-Fire safety specialist'!G63","v":0}]
[null,null,{"$f":"IF('B151a-Fire safety specialist'!F63=\"\",\"\",\"LIST\")","v":""}]
[null,"FIR - 046",{"$f":"'B151a-Fire safety specialist'!F64","v":"We believe it is more appropriate for your emergency lighting designer to carry out the necessary inspections and provide a PS4 for the emergency lighting design at the completion of the project. Please confirm this is to be arranged.\nADDED 13/7/2017 - Query outstanding"},null,{"$f":"'B151a-Fire safety specialist'!G64","v":"Resolved"}]
[null,null,{"$f":"IF('B151a-Fire safety specialist'!F64=\"\",\"\",\"LIST\")","v":"LIST"}]
[null,"FIR - 047",{"$f":"'B151a-Fire safety specialist'!F65","v":0},null,{"$f":"'B151a-Fire safety specialist'!G65","v":0}]
[null,null,{"$f":"IF('B151a-Fire safety specialist'!F65=\"\",\"\",\"LIST\")","v":""}]
[null,"FIR - 048",{"$f":"'B151a-Fire safety specialist'!F67","v":0},null,{"$f":"'B151a-Fire safety specialist'!G67","v":0}]
[null,null,{"$f":"IF('B151a-Fire safety specialist'!F67=\"\",\"\",\"LIST\")","v":""}]
[null,"FIR - 049",{"$f":"'B151a-Fire safety specialist'!F68","v":0},null,{"$f":"'B151a-Fire safety specialist'!G68","v":0}]
[null,null,{"$f":"IF('B151a-Fire safety specialist'!F68=\"\",\"\",\"LIST\")","v":""}]
[null,"FIR - 050",{"$f":"'B151a-Fire safety specialist'!F69","v":0},null,{"$f":"'B151a-Fire safety specialist'!G69","v":0}]
[null,null,{"$f":"IF('B151a-Fire safety specialist'!F69=\"\",\"\",\"LIST\")","v":""}]
[null,"FIR - 051",{"$f":"'B151a-Fire safety specialist'!F70","v":0},null,{"$f":"'B151a-Fire safety specialist'!G70","v":0}]
[null,null,{"$f":"IF('B151a-Fire safety specialist'!F70=\"\",\"\",\"LIST\")","v":""}]
[null,"FIR - 052",{"$f":"'B151a-Fire safety specialist'!F71","v":0},null,{"$f":"'B151a-Fire safety specialist'!G71","v":0}]
[null,null,{"$f":"IF('B151a-Fire safety specialist'!F71=\"\",\"\",\"LIST\")","v":""}]
[null,null,{"$f":"IF('B151b-Fire safety specialist'!K40>1,'B151b-Fire safety specialist'!O38,\"\")","v":""}]
[null,"DPF - 001",{"$f":"'B151b-Fire safety specialist'!F22","v":0},null,{"$f":"'B151b-Fire safety specialist'!G22","v":0}]
[null,null,{"$f":"IF('B151b-Fire safety specialist'!F22=\"\",\"\",\"LIST\")","v":""}]
[null,"DPF - 002",{"$f":"'B151b-Fire safety specialist'!F23","v":0},null,{"$f":"'B151b-Fire safety specialist'!G23","v":0}]
[null,null,{"$f":"IF('B151b-Fire safety specialist'!F23=\"\",\"\",\"LIST\")","v":""}]
[null,"DPF - 003",{"$f":"'B151b-Fire safety specialist'!F25","v":0},null,{"$f":"'B151b-Fire safety specialist'!G25","v":0}]
[null,null,{"$f":"IF('B151b-Fire safety specialist'!F25=\"\",\"\",\"LIST\")","v":""}]
[null,"DPF - 004",{"$f":"'B151b-Fire safety specialist'!F27","v":0},null,{"$f":"'B151b-Fire safety specialist'!G27","v":0}]
[null,null,{"$f":"IF('B151b-Fire safety specialist'!F27=\"\",\"\",\"LIST\")","v":""}]
[null,"DPF - 005",{"$f":"'B151b-Fire safety specialist'!F28","v":0},null,{"$f":"'B151b-Fire safety specialist'!G28","v":0}]
[null,null,{"$f":"IF('B151b-Fire safety specialist'!F28=\"\",\"\",\"LIST\")","v":""}]
[null,"DPF - 006",{"$f":"'B151b-Fire safety specialist'!F29","v":0},null,{"$f":"'B151b-Fire safety specialist'!G29","v":0}]
[null,null,{"$f":"IF('B151b-Fire safety specialist'!F29=\"\",\"\",\"LIST\")","v":""}]
[null,"DPF - 007",{"$f":"'B151b-Fire safety specialist'!F30","v":0},null,{"$f":"'B151b-Fire safety specialist'!G30","v":0}]
[null,null,{"$f":"IF('B151b-Fire safety specialist'!F30=\"\",\"\",\"LIST\")","v":""}]
[null,"DPF - 008",{"$f":"'B151b-Fire safety specialist'!F31","v":0},null,{"$f":"'B151b-Fire safety specialist'!G31","v":0}]
[null,null,{"$f":"IF('B151b-Fire safety specialist'!F31=\"\",\"\",\"LIST\")","v":""}]
[null,"DPF - 009",{"$f":"'B151b-Fire safety specialist'!F32","v":0},null,{"$f":"'B151b-Fire safety specialist'!G32","v":0}]
[null,null,{"$f":"IF('B151b-Fire safety specialist'!F32=\"\",\"\",\"LIST\")","v":""}]
[null,"DPF - 010",{"$f":"'B151b-Fire safety specialist'!F33","v":0},null,{"$f":"'B151b-Fire safety specialist'!G33","v":0}]
[null,null,{"$f":"IF('B151b-Fire safety specialist'!F33=\"\",\"\",\"LIST\")","v":""}]
[null,"DPF - 011",{"$f":"'B151b-Fire safety specialist'!F34","v":0},null,{"$f":"'B151b-Fire safety specialist'!G34","v":0}]
[null,null,{"$f":"IF('B151b-Fire safety specialist'!F34=\"\",\"\",\"LIST\")","v":""}]
[null,"DPF - 012",{"$f":"'B151b-Fire safety specialist'!F35","v":0},null,{"$f":"'B151b-Fire safety specialist'!G35","v":0}]
[null,null,{"$f":"IF('B151b-Fire safety specialist'!F35=\"\",\"\",\"LIST\")","v":""}]
[null,"DPF - 013",{"$f":"'B151b-Fire safety specialist'!F36","v":0},null,{"$f":"'B151b-Fire safety specialist'!G36","v":0}]
[null,null,{"$f":"IF('B151b-Fire safety specialist'!F36=\"\",\"\",\"LIST\")","v":""}]
[null,"DPF - 014",{"$f":"'B151b-Fire safety specialist'!F37","v":0},null,{"$f":"'B151b-Fire safety specialist'!G37","v":0}]
[null,null,{"$f":"IF('B151b-Fire safety specialist'!F37=\"\",\"\",\"LIST\")","v":""}]
[null,"DPF - 015",{"$f":"'B151b-Fire safety specialist'!F39","v":0},null,{"$f":"'B151b-Fire safety specialist'!G39","v":0}]
[null,null,{"$f":"IF('B151b-Fire safety specialist'!F39=\"\",\"\",\"LIST\")","v":""}]
[null,null,{"$f":"IF('B160-PS specialist'!N23>1,'B160-PS specialist'!T23,\"\")","v":"Specialist Review : Mechanical Ventilation  (Nick Waddington )"}]
[null,"SER - 001",{"$f":"'B160-PS specialist'!F21","v":"The specialist services reviewer of this application requires the following additional information:\n\nPlease provide PS1 (Design) and associated design details, showing Compliance with Clauses G4 and H1.3.6 of the New Zealand Building Code. Also, a schedule of inspections to be undertaken by the engineer with confirmation that 'as built' drawings and a PS4 will be provided on successful commissioning of the ventilation systems.                      Response received 12/7/17 does not address RFI                                            Response received 1/8/17 gives no indication of how internal office and meeting room are ventilated, does not give any extract rates for toilets and PS1 provided gives no indication that PS4 will be provided.\n"},null,{"$f":"'B160-PS specialist'!G21","v":"Resolved"}]
[null,null,{"$f":"IF('B160-PS specialist'!F21=\"\",\"\",\"LIST\")","v":"LIST"}]
[null,"SER - 002",{"$f":"'B160-PS specialist'!F22","v":0},null,{"$f":"'B160-PS specialist'!G22","v":0}]
[null,null,{"$f":"IF('B160-PS specialist'!F22=\"\",\"\",\"LIST\")","v":""}]
[null,"SER - 003",{"$f":"'B160-PS specialist'!F23","v":0},null,{"$f":"'B160-PS specialist'!G23","v":0}]
[null,null,{"$f":"IF('B160-PS specialist'!F23=\"\",\"\",\"LIST\")","v":""}]
[null,null,{"$f":"IF('B160-PS specialist'!N26>1,'B160-PS specialist'!P26,\"\")","v":""}]
[null,"SER - 004",{"$f":"'B160-PS specialist'!F25","v":0},null,{"$f":"'B160-PS specialist'!G25","v":0}]
[null,null,{"$f":"IF('B160-PS specialist'!F25=\"\",\"\",\"LIST\")","v":""}]
[null,"SER - 005",{"$f":"'B160-PS specialist'!F26","v":0},null,{"$f":"'B160-PS specialist'!G26","v":0}]
[null,null,{"$f":"IF('B160-PS specialist'!F26=\"\",\"\",\"LIST\")","v":""}]
[null,null,{"$f":"IF('B160-PS specialist'!N29>1,'B160-PS specialist'!P32,\"\")","v":""}]
[null,"SER - 006",{"$f":"'B160-PS specialist'!F28","v":0},null,{"$f":"'B160-PS specialist'!G28","v":0}]
[null,null,{"$f":"IF('B160-PS specialist'!F28=\"\",\"\",\"LIST\")","v":""}]
[null,"SER - 007",{"$f":"'B160-PS specialist'!F29","v":0},null,{"$f":"'B160-PS specialist'!G29","v":0}]
[null,null,{"$f":"IF('B160-PS specialist'!F29=\"\",\"\",\"LIST\")","v":""}]
[]
[null,"Please respond fully within 20 working days. If you do not respond within this timeframe your application may be refused."]
[null,"An early response will assist in the completion of consent processing with minimal delays.\n\nWhen replying to our request, please provide a covering letter stating what action has been taken for each item, and highlight all changes to revised documentation."]
[null,"To submit the requested documentation:\n.          Use the Upload additional information option at http://onlineservices.ccc.govt.nz. If you are \n           not already registered for Online Services, you can register for free at any time at \n           http://onlineservices.ccc.govt.nz. For more information, see www.ccc.govt.nz/bcguide. \n.          Alternatively, you can post or deliver your application to the address below. However, you \n           can eliminate scanning fees, and reduce processing fees and delays, by submitting \n           documents online."]
[null,"Please do not lock or password‐protect PDFs, as they have to be merged into final consent documents. This letter is sent to the applicant and the owner, where possible."]
[null,"Yours sincerely"]
[null,null,"."]
[null,null,"."]
[null,null,"."]
[null,{"$f":"'Summary sheet'!E51","v":"Tania McGrath"}]
[null,{"$f":"'Summary sheet'!E52","v":"Building Consent Officer"}]

{"sheet":"B120-Processing sheet","index":4,"n_rows":245,"n_cols":27,"rows_kept":245,"cut":false,"hidden":false,"merged":[[7,8,7,9],[4,1,4,6],[182,1,182,2],[188,1,188,2],[207,1,207,2],[148,1,148,2],[146,1,146,2],[141,1,141,2],[126,1,126,2],[119,1,119,2],[110,1,110,2],[30,1,30,2],[107,1,107,2],[90,1,90,2],[88,1,88,2],[81,1,81,2],[5,4,5,6],[7,4,7,6],[9,1,9,3],[6,1,6,3],[5,1,5,3],[7,1,7,3],[9,4,9,6],[8,4,8,6],[8,1,8,3],[242,1,242,4],[13,1,13,2],[28,1,28,2],[6,4,6,6],[10,1,10,6],[11,1,11,3],[11,4,11,6],[165,1,165,2],[152,1,152,2],[155,1,155,2],[169,1,169,2],[174,1,174,2],[176,1,176,2],[227,1,227,2],[232,1,232,2],[238,1,238,2],[39,1,39,2],[225,1,225,2],[223,1,223,2],[204,1,204,2],[235,1,235,2],[200,1,200,2],[215,1,215,2],[192,1,192,2],[195,1,195,2],[198,1,198,2],[163,1,163,2],[161,1,161,2],[159,1,159,2]]}
[null,null,null,null,null,null,null,null,"Summary sheet","B501-Not accepted letter"]
[null,"B-120 LU:  20.12.16 LR: 20.12.16 v16",null,null,null,null,null,null,"Vetting sheet","B501a-Not accepted with invoice"]
[null,null,null,null,null,null,null,null,"B120-Processing sheet","Application update letter"]
[null,null,null,null,null,null,null,null,"B150-Structural specialist","B521-RFI letter"]
[null,"Form B-120                                                             COMMERCIAL 1 – 3  PROCESSING SHEET",null,null,null,null,null,null,"B151a-Fire safety specialist","B529-Final reminder letter"]
[null,"Building consent number (BCN):   ","Building consent number (BCN):   ","Building consent number (BCN):   ",{"$f":"'Summary sheet'!E15","v":"BCN/2017/2013"},null,null,null,"B151b-Fire safety specialist","B532-Refusal letter"]
[null,"Project address:   ","Project address:   ","Project address:   ",{"$f":"'Summary sheet'!E16","v":"80 Byron Street Sydenham "},null,null,null,"B160-PS specialist","S71-74 natural hazards","Y"]
[null,"Description of building work:","Project description:","Project description:",{"$f":"'Summary sheet'!E17","v":"Addition to Factory - New Offices, Meeting and Store Room"},null,null,null,"B462-Draft CS",null,"N/A"]
[null,"Building level:        ","Building level:        ","Building level:        ",{"$f":"'Summary sheet'!E18","v":"Commercial 1"},null,null,null,null,null,"RFI"]
[null,"Classified use(s):  ","Classified use(s):  ","Classified use(s):  ",{"$f":"'Summary sheet'!E19","v":"Commercial"}]
[]
[null,"Commercial 1 - Commercial, industrial and communal non-residential buildings and their associated outbuildings and ancillary buildings equal to or less than two storeys and an occupancy load of equal to or less than 100 people or SR or SA residential buildings up to two storeys and with horizontal fire separation.\nCommercial 2 - Commercial, industrial, communal residential and communal non-residential buildings equal to or less than four storey and an occupancy load of equal to or less than 500 people or SC or SD that are single storey.\nCommercial 3 - All uses of buildings that are over four storeys high, or contain over 500 occupants or SC or SD greater than single storey.",null,null,"Key for abbreviations to answering processing questions\nY - The application satisfies the intent of the question. Provide comment if appropriate\nN/a - The question is not applicable to this application. Provide comment if appropriate\nRFI - The application has not meet the intent of this question and a request for information is required. Write request in RFI cell for inclusion in RFI letter. The application must not be granted until all RFIs are resolved and the answer has been changed to Yes or N/a\nUse Resolved, Awaiting Review or Not resolved in the far right column to indicate status of RFI item after receiving a response to the RFI item. This will appear on any further RFI letters"]
[null,null,"Questions to be answered\nAlso refer to inserted comments","Y, N/A RFI","Comments","RFI","RFI Resolved"]
[null,{"$f":"Z14&\"   \"&Z15","v":"GENERAL / PIM / SITE:     "},null,null,null,null,null,null,null,null,"Comments","RFI","Resolved",null,null,null,null,null,null,null,null,null,null,null,null,"GENERAL / PIM / SITE:  "]
[null,1,"Has the application been accepted with sufficient information to start processing?","Y","review of documentation appears sufficient",null,null,null,null,null,"The performance required by this question is not applicable to the building work included in this application","The application does not include sufficient information for the following items:","Not Resolved",null,null,null,null,null,null,null,null,null,{"$f":"IF(D15=\"RFI\",1,\"\")","v":""},{"$f":"IF(D15=\"\",1,(IF(D15=\"RFI\",1,(IF(G15=\"NOT RESOLVED\",1,\"\")))))","v":""},{"$f":"SUM(X15:X28)","v":0},{"$f":"IF(Y18=TRUE,\"REVIEW INCOMPLETE\",\"\")","v":""},{"$f":"IF(Z15<>\"\",1,\"\")","v":""}]
[null,"1A","Where the building work includes restricted building work are there correctly completed:\n• Certificates of design work covering all the restricted building work?\n• Statutory declaration as to owner-builder status' (Form 2B) been provided?","N/A","not residential",null,null,null,null,null,"This question is not applicable because the existing building's compliance is unchanged by the building work included in this application ","The application includes restricted building work. Provide a certificate of design work from each licensed building practitioner [design, including engineers] for the restricted building work",null,null,null,null,null,null,null,null,null,null,null,{"$f":"IF(D16=\"\",1,(IF(D16=\"RFI\",1,(IF(G16=\"NOT RESOLVED\",1,\"\")))))","v":""}]
[null,"1B","Has the Certificate of Title been checked for easements and consent notices that may affect the project?","Y","CT dated 04/01/17 supplied (app form)\neasement for drive and parking - indicated in site plan - new works not impacting on easement\nnil other issues identified",null,null,null,null,null,"Complies with the acceptable solution","The Certificate of Title identifies the following issues that need to be addressed ",null,null,null,null,null,null,null,null,null,null,null,""]
[null,2,"Has the PIM / Development Report been checked for matters that may affect the building work?","Y","Development Report\nSection 37 - note revised drawings submitted\nSection 36\nBLC - FFL requirements - confirm with supervisor - depends on if survey of site provided if not will be required - required refer Q8\nDevelopment levels - E1=14.27\nTCNA\nAuthorisation to discharge to sewerage - email sent 06/04/17 - approval received refer TRIM17/356267\nAuthorisation for stormwater approval - email sent 06/04/17 - approval received refer TRIM17/363256\nTradewaste - addition unlikely to impact any existing requirements - doesn't affect compliance with building code\nLPG requirements - refer Q162\nnil other significant issues identified\n",null,null,null,null,null,"Complies by specific engineering design","The Project Information Memorandum shows that the project has the following issues that need to be addressed:",null,null,null,null,null,null,null,null,null,null,{"$f":"IF(D18=\"RFI\",1,\"\")","v":""},{"$f":"IF(D18=\"\",1,(IF(D18=\"RFI\",1,(IF(G18=\"NOT RESOLVED\",1,\"\")))))","v":""},{"$f":"IF(Y15>0,TRUE,FALSE)","v":false}]
[null,3,"Has Smart Map been checked for further matters, e.g. location of existing features, structures, hazards, services and outstanding consents that may affect the building work? ","Y",null,null,null,null,null,null,null,"A development report produced for the project has the following issues that need to be addressed:",null,null,null,null,null,null,null,null,null,null,"",""]
[null,4,"Has requests for utility connections on the application form and existing utility locations on Smart Map or drainage plan been checked?","N/A","existing connections",null,null,null,null,null,null,"Please note that the Project Information Memorandum (PIM) is not available at present and other matters pertaining to the PIM may need to be addressed.",null,null,null,null,null,null,null,null,null,null,"",""]
[null,5,"Do drainage outfalls require the connection to a common drain?","N/A",null,null,null,null,null,null,null,"Christchurch City Council records show that this site has the following issues that need to be addressed ",null,null,null,null,null,null,null,null,null,null,"",""]
[null,6,"Does the site plan show sufficient floor, ground and drain invert levels to establish compliance with B1, E1, E2, G13 and the City Plan?","Y","no levels provided\n\n13/07/17 - levels provided ","Provide on the site plan, sufficient levels to establish compliance with [B1, E1, E2, G13, City Plan]. These should include new and existing finished floor levels and site levels to Christchurch Drainage Datum, including datum point location.","Resolved",null,null,null,null,"Please confirm utility connections requested on the application form.  Council records indicate ",null,null,null,null,null,null,null,null,null,null,"",""]
[null,7,"Does site plan show boundary locations and dimensions, building setbacks to boundaries and other buildings?","Y","no external wall to boundary dimension\n\n13/07/17 - response indicates that will be constructed as per existing wall, however survey plan indicates existing building may be constructed over boundary\n\n31/07/17 - note added to sheet A2","Please indicate the location of the block wall on the site plan in relation to the boundary to demonstrate that this building will be constructed within the boundaries of the property (including foundations).\n\n13/07/07 - thank you for your response, however the survey plan suggests that the existing building may be constructed over the boundary. Please confirm that the addition will be constructed wholly within the boundaries of this property, note you will be required to supply a building location certificate at setout of the foundation to confirm that the addition is within the property boundary.","Resolved",null,null,null,null,"This application shows a connection to a common drain. Provide completed forms B-042 and B-043, which are available from https://www.ccc.govt.nz/consents-and-licences/building-consents/building-consent-forms-and-guides/",null,null,null,null,null,null,null,null,null,null,"",""]
[null,8,"Will a building location certificate be required?","Y","FFL requirement ",null,null,null,null,null,null,"Provide a geotechnical report used to establish the suitability of the foundation design.",null,null,null,null,null,null,null,null,null,null,"",""]
[null,9,"Does the building work involve the removal or demolition of a building and has sufficient details been provided to be satisfied that this work will meet the provisions of the building code?","N/A",null,null,null,null,null,null,null,"Provide on the site plan, sufficient levels to establish compliance with [B1, E1, E2, G13, City Plan].",null,null,null,null,null,null,null,null,null,null,"",""]
[null,10,"Has a sediment control management plan been provided that is relevant to project to achieve compliance with B1 and E1?","Y","reference to city plan and ECAN guide sheet A2\nflat site\npotential for existing drainage within hardstanding area\n\n13/07/17 - note added A1 & A2 - to comply with ECANrules","Please provide a site specific sediment control plan taking into consideration any drainage outlets that may be existing on site hardstanding area.","Resolved",null,null,null,null,"Provide on the site plan, boundary locations and setback dimensions to boundaries and other buildings.",null,null,null,null,null,null,null,null,null,null,"",""]
[null,11,"Has processing the application identified the building work is related to a claim under the WHRS Act 2006?\nIf yes ensure description of building work includes ‘related to a claim under WHRS Act 2006’","N/A",null,null,null,null,null,null,null,"A building location certificate will be required.",null,null,null,null,null,null,null,null,null,null,"",""]
[null,12,"List all producer statements submitted with building consent application to support demonstrating compliance with building code that are being accepted by the BCO\nProducer statements for design and design review are to;\n• be accompanied by supporting information e.g. calculations and test reports.\n• clearly describe the building work that it is covering\n• state the address of where the proposed building work is to be carried out (exception for producer statements for proprietary building systems)\n• state the building code clauses that the building work will comply with\n• state the means of compliance used for assessing the building work’s compliance with the relevant building code clauses.\n• reference the drawings being covered\n• state any verification of design assumptions\n• state whether construction monitoring is to be undertaken by the design professional and precisely which building elements are to be inspected\n• state the author’s qualifications and registration number\n• be signed and dated","Y","William Julius Long CPEng 231242\nStructex Harvard Ltd\nproposed new office addition\nB1\ndrawings referenced\ngeotech safe bearing 50kPa or more\nsigned and dated 01/02/17\nInspections:\nCM3 level indicated no schedule or confirmation of PS4\n\n13/07/17 - construction monitoring and confirmation of PS4 provided - added in Connect","Please provide schedule of construction monitoring that will be conducted by the structural engineer and confirm that a PS4 will be provided when construction complete.","Resolved",null,null,null,null,"Provide on a site plan the extent of the demolition work and the locations of termination points of the services.",null,null,null,null,null,null,null,null,null,null,"",""]
[null,{"$f":"Y29&\"   \"&Z29","v":"BUILDING ACT 2004:   "},null,null,null,null,null,null,null,null,null,"Provide a sediment control management plan, that is relevant to the project, to achieve compliance with B1 and E1.",null,null,null,null,null,null,null,null,null,null,"",null,"BUILDING ACT 2004:",{"$f":"IF(X30=1,\"REVIEW INCOMPLETE\",\"\")","v":""},{"$f":"IF(Z29<>\"\",1,\"\")","v":""}]
[null,13,"Are there specific sections of the Building Act to be considered and have procedures for complying with these sections been followed?\nList applicable sections and provide comment if appropriate\n• s44 (2) Application for stages of the proposed building work\n• s67-70: Waivers or modifications\n• s71-74: Construction of building on land subject to natural hazards (Where applicable use the S71-74 natural hazards processing tab)\n• s75-83: Construction of building on 2 or more allotments\n• s112: Alteration to existing buildings\n• s113: Buildings with specified intended lives\n• s115: Change of use\n• s116: Extension of life\n• s116A: Subdivision\n• s118: Access and facilities for persons with disabilities \n• s131: Policy on dangerous, earthquake-prone, insanitary buildings\n• s268: Certification of building methods or products\n• s26:  Warnings and bans\n• s39: Territorial Authority to advise Heritage New Zealand","Y","Section 112 - DEE requested, means of escape assessed by Fire engineer\n- no indication that existing buildings current level of ability to comply will be reduced as a result of new works.\nSection 118 details provided refer Q70",null,null,null,null,null,null,"The building work involves re-cladding where the original cladding has not met its requirements under Building Code clause B2, durability.  Please provide",null,null,null,null,null,null,null,null,null,null,"","",{"$f":"IF(X30=\"\",FALSE,TRUE)","v":false}]
[null,{"$f":"Z31&\" \"&Z36","v":"B1 - STRUCTURE:   "},null,null,null,null,null,null,null,null,null,"Provide a producer statement for design to cover specific design of the [structural, hydraulic, …] elements of the project.",null,null,null,null,null,null,null,null,null,null,null,false,{"$f":"IF(X31=TRUE,TRUE,IF(SUM(X32:X39)>0,FALSE,TRUE))","v":true},"B1 - STRUCTURE:  "]
[null,14,"Has the proposed building work had a specialist structural review on form B-150 and is it clear which structural elements  were covered?","N/A","Confirmation from Rolando Basobas that review can be completed by BCO under supervision.",null,null,null,null,null,null,"The producer statement for design does not include the following details or supporting information  [address, code clauses, calculations…]. Revise and resend.",null,null,null,null,null,null,null,null,null,null,"","",{"$f":"IF(X31=TRUE,TRUE,IF(Y31=TRUE,TRUE,FALSE))","v":true},{"$f":"IF(Y32=FALSE,\"REVIEW INCOMPLETE\",\"\")","v":""}]
[null,15,"Has there been sufficient geotechnical investigation to establish the suitability of the foundation design? ","N/A","Geotechnical engineer to review refer B150",null,null,null,null,null,null,"This application is for a staged consent under Section 44 (2) of the Building Act […].",null,null,null,null,null,null,null,null,null,null,{"$f":"IF(D33=\"RFI\",1,\"\")","v":""},{"$f":"IF(D33=\"\",1,(IF(D33=\"RFI\",1,(IF(G33=\"NOT RESOLVED\",1,\"\")))))","v":""}]
[null,16,"Are there primary structural elements in the proposed building work that are specific engineering design (SED) and are being reviewed by the BCO?\nList the primary structural elements and provide comment for how you are satisfied on reasonable grounds that the provisions of the building code will be met.","Y","Design features report provided\n- design criteria appears consistent with property and project\nextension size 12.8 x 8.02m\nNo calculations provided\n\nFoundations\n- 100mm concrete slab with SE82 mesh\n- 300x1500 perimeter wall footings - H12 starters@400 crs with 3/1H12 top and bottom - over DPM and compacted fill\n- 300x300 internal loadbearing wall slab thickenings - 4/H12's R6 stirrups @ 200 crs\n- H12@ 400crs 600 into slab from thickening standard 90 degree hook around trimmer bar outside wall starter\n\nconnection to existing\n750mm M12 rods embedded 150mm into existing slab with Hilti Hit Re 500 epoxy @ 400 crs and 600 lap into new slab - roughen surface of existing\n\nWalls\n- 15 series masonry block, stack bond - D16's @ 200 crs horizontal in 3 courses, 850mm lap by roof connection, H12's horizontal to rest of wall\n- H12's @ 400 crs horizontally 1100 lap, H12 @ 400crs vertically 850 lap\n- H12 starters @ 400 crs\nframing to block walls M12 100mm embedment Hilit Hit RE500 @ 600 crs\n\nno connections of block walls to existing concrete walls provided\n\nno lateral stability for 150 series stack bond walls - noted purlins run parallel\n\nRoof \n- DHS 150/15 purlin @ 1200crs 8mm angled galv steel cleat with 1/M12 hex bolt through top plate\n- 150x90 X8 EA 100mm long 2/M12 bolts in purlin, 1/M12 bolt into 140x45 double top plate\n- Lumberlok CPC80 purlin cleat each side 30x3.15 anils and 17-14gx35mm hex head galv screws\n\nSteel\n- 250 PFC\n- 89x5 SHS on 155x100x10 right angle MS plate 6mm fillet weld\n- load transferred to new addition via cross braces - connection details A14\n\n13/07/17\n1. calculations provided\n2. A22 indicates 50mm separation from existing building\n3. confirmation structures do not provide support and will be removed as required\n4. detail provided A22\n5. calculations provide - noted bracing walls located between length of stack bond walls which provide lateral support\n6. calculations provided with markup - supp docs\n7. within scope of structural engineer calcs provided\n\n04/08/17 - lintel detail for extended open provided - calcs to support design also provided","1. Please provide a copy of the structural engineering calculations to allow for assessment of compliance with the requirements of B1. RESOLVED\n\n2. Please provide details of how it is intended to connect the new walls to the existing external walls of the building sufficient to demonstrate compliance with requirements of B1 taking into consideration that the design features report indicates that the buildings will be seismically separated however the foundations have been tied together. RESOLVED\n\n3. The information available to Council indicates the presence of external metal structures that appear to be potentially providing additional structural support to the existing building. Please confirm if this is occuring and if so how will that structural element continue to be maintained when the new addition is added. RESOLVED\n\n4. Please provide detail demonstrating how the roof brace in connected to structural elements on Grid line 2 and the central SHS post on Gridline 1 sufficient to demonstrate compliance with the requirements of B1. RESOLVED\n\n5. Please provide documentation to demonstrate that the lateral stability of the stack bond block walls has been achieved sufficient to demonstrate compliance with B1. RESOLVED\n\n6. Please provide a bracing plan and calculations sufficient to demonstrate compliance with the requirements of B1. RESOLVED\n\n7. The lintel above the sliding door appears to be specific design. Please provide documentation to support the size of the lintel indicated in detail 17 sheet A16. RESOLVED\n\n8. The drawings indicate that the opening in the existing wall will be significantly extended. Please provide details of the support for this opening and evidence that the bracing of the existing building can be maintained with this new opening.\n\n14/07/17 - Unable to locate information within engineering calculations as indicated - please direct me to where this information is located.","Resolved",null,null,null,null,"This application has requested that the territorial authority grant a building consent subject to a waiver or modification to building code clause/s […], in accordance with Building Act Section 67. Provide […].",null,null,null,null,null,null,null,null,null,null,"","",null,{"$f":"AND(Z32=\"\",Z40=\"\")","v":true}]
[null,17,"Are there secondary structural elements in the proposed building work that are SED and are being reviewed by the BCO? \nList the secondary structural elements and provide comment for how you are satisfied on reasonable grounds that the provisions of the building code will be met ","N/A",null,null,null,null,null,null,null,"This is an application for building on land subject to natural hazards.  The natural hazards are; [state hazards]   Section 71 – 74 of the Building Act applies.  Please provide ",null,null,null,null,null,null,null,null,null,null,"","",null,{"$f":"IF(Z34=FALSE,\"REVIEW INCOMPLETE\",\"\")","v":""}]
[null,18,"Have adequate construction details been provided in the plans and specifications of SED structural elements to be satisfied the provisions of the Building Code will be met?","Y","refer Q15 for additional details",null,null,null,null,null,null,"This application is for the construction of a building on two or more allotments. Procedures for complying with sections 75-83 of the Building Act, in relation to the affected certificates of title to the allotments, need to be followed. Please advise the action the owner intends to take.",null,null,null,null,null,null,null,null,null,null,"","",null,{"$f":"IF(X31=TRUE,\"\",Z35)","v":""},{"$f":"IF(Z36<>\"\",1,\"\")","v":""}]
[null,19,"Are there parts of the building work that are designed using other Standards or Approved Documents from B1/AS1 and has adequate construction details been provided?\nList applicable acceptable solutions and provide comment if appropriate\n• Masonry NZS 4229\n• Earth Buildings NZS 4299\n• Stucco NZS 4251\n• Drains AS/ NZS 2566.1, AS/NZS2566.2, AS/NZS 2032, AS/NZS2033 \n• Glazing NZS 4223\n• Small Chimneys B1/AS3","N/A","no structural elements relating to these standards indicated",null,null,null,null,null,null,"This is an application for an alteration to a building. Section 112 of the  Building Act applies.  The building consent authority needs to be satisfied that the building after the alteration will comply, as nearly as is reasonably practicable, with the provisions of the building code that relate to means of escape from fire and access and facilities for persons with disabilities and the building will if it complied with the other provisions of the building code immediately before the building work began, continue to comply with those provisions; or if it did not comply with the other provisions of the building code immediately before the building work began, continue to comply at least to the same extent as it did then comply. Please provide",null,null,null,null,null,null,null,null,null,null,"",""]
[null,20,"For alterations to existing buildings has consideration been given to s112 (b) or if a change of use has consideration been given to s115? Ensure adequate details been provided of connection of new structural elements to existing","Y","No existing DEE located on property file\n\n13/07/17 - no report located\n\n31/07/17 - DEE report provided 78-82 Byron Street Jun 2014","As this project involves connection with the existing building please provide a Detailed Engineering Evaluation (DEE) for the existing building.\n\n13/07/17 - Your response refers to a report by Holmes Consulting, however no report was received","Resolved",null,null,null,null,"This application is for a proposed or an existing building proposed to be altered that is intended to have a life of [less than 50 years]. Section 113 of the Building Act applies.  The territorial authority may grant a building consent only if the consent is subject to the condition that the building must be altered, removed or demolished on or before the end of the specified intended life and any other conditions that the territorial authority considers necessary. Please provide",null,null,null,null,null,null,null,null,null,null,"",""]
[null,21,"For building work designed to NZS 3604 have the correct design parameters been applied?\nCorrosion, Wind, Earthquake and Snow load","Y","Wind - H\nEQ - 2\nExposure - C\nsnow - N4 <100m",null,null,null,null,null,null,"This application is for building work that will change the use of the building as defined in the Building (Specified Systems, Change the Use, and Earthquake prone Buildings) Regulations 2005.  Section 115 of the Building Act applies.  Please provide  ",null,null,null,null,null,null,null,null,null,null,"",""]
[null,"NZS 3604 CONSTRUCTION:",null,null,null,null,null,null,null,null,null,"This application is for building work that proposes to extend the life of a building with a specified intended life.  Section 116 of the Building Act applies.  Please provide The territorial authority is not satisfied that this proposal to extend the specified life of the building beyond that stated in the Building Consent [ABA…, BCN…] will meet the requirements of Section 116 of the Building Act in the following ways:",null,null,null,null,null,null,null,null,null,null,null,false,{"$f":"AND(X40=FALSE,SUM(X41:X81)>0)","v":false},{"$f":"IF(Y40=TRUE,\"REVIEW INCOMPLETE\",\"\")","v":""}]
[null,22,"Is the building within the scope and limitations of NZS 3604 as described in section 1.1.2?","Y","only timber wall framing and ceiling lining within scope",null,null,null,null,null,null,"This application is for building work that relates to a proposed subdivision affecting a building or part of a building.  Section 116A of the Building Act applies.  Please provide ",null,null,null,null,null,null,null,null,null,null,"",""]
[null,23,"Does the building site meet the requirements of 3.1.2 and has good ground been determined as per 3.1.3?","N/A",null,null,null,null,null,null,null,"This application is for building work to a building that is defined by Section 118 of the Building Act to have access and facilities for persons with disabilities to and within buildings. New buildings are to comply fully and existing buildings to comply as nearly as is reasonably practicable, with the provisions of the building code for access and facilities for persons with disabilities. Provide a report on the facilities for persons with disabilities. Form B-065, available on the CCC website, may be used as a check sheet to assist you.",null,null,null,null,null,null,null,null,null,null,"",""]
[null,24,"Have other site requirements been considered?","N/A",null,null,null,null,null,null,null,"Provide details of specific design to demonstrate compliance with B1 - Structure in regards to the following elements.",null,null,null,null,null,null,null,null,null,null,"",""]
[null,25,"Do timber and wood based products comply with section 4.3?","Y","H1.2 - noted some elements with flood level - refer Q64",null,null,null,null,null,null,"Provide adequate construction details of specific design elements to ensure the provisions of the Building Code will be met.",null,null,null,null,null,null,null,null,null,null,"",""]
[null,26,"Do steel fixings and fastenings comply with section 4.4?","Y","specifications",null,null,null,null,null,null,"Please clarify whether a Standard or Approved Document from B1/AS1 have been used for the design and provide adequate construction details for the following elements",null,null,null,null,null,null,null,null,null,null,"",""]
[null,27,"Does concrete and concrete masonry comply with section 4.5?","Y","25MPa - specifications",null,null,null,null,null,null,"This application is for building work that is outside the scope and limitations of NZS 3604:2011 Please provide",null,null,null,null,null,null,null,null,null,null,"",""]
[null,28,"Have the correct parameters been used for determining bracing demand?","N/A","SED",null,null,null,null,null,null,"This application is for building work that is using NZS 3604:2011 to demonstrate compliance with B1 – Structure for the foundation design. This building consent authority is not satisfied that the requirements, to determine good ground, of clause 3.1.2 and/or 3.1.3 of this standard and/or paragraph 3.1.1 of B1/AS1 have been met. If further evidence cannot be provided to meet these requirements the foundations require specific engineering design.",null,null,null,null,null,null,null,null,null,null,"",""]
[null,29,"Where applicable does sub-floor bracing design comply with section 5.5?","N/A",null,null,null,null,null,null,null,"This application is for building work that is using NZS 3604:2011 to demonstrate compliance with B1 – Structure. Show site requirements comply with Section 3.  Consider bearing, site preparation, water in subfloor spaces and effects of tree roots on foundations  ",null,null,null,null,null,null,null,null,null,null,"",""]
[null,30,"Does wall-bracing design comply with section 5.4? ","N/A","SED",null,null,null,null,null,null,"This application is for building work that is using NZS 3604:2011 to demonstrate compliance with B2 - Durability. Show how timber and wood based products comply with section 4.3",null,null,null,null,null,null,null,null,null,null,"",""]
[null,31,"Where diaphragms have been used with a brace wall system do they comply with section 5.6?","N/A",null,null,null,null,null,null,null,"This application is for building work that is using NZS 3604:2011 to demonstrate compliance with B2 - Durability. Show how steel fixings and fastenings comply with section 4.4",null,null,null,null,null,null,null,null,null,null,"",""]
[null,32,"Where wall-bracing design involves reinforced concrete or concrete masonry walls and/or dragon ties do they comply with section 8.3?","N/A","SED",null,null,null,null,null,null,"This application is for building work that is using NZS 3604:2011 to demonstrate compliance with B2 - Durability. Show how concrete and concrete masonry comply with section 4.5.",null,null,null,null,null,null,null,null,null,null,"",""]
[null,33,"Does the sub-floor system and the set out of the sub-floor system comply with sections 6.2 & 6.3? Consider load paths through the building and spans of bearers and floor joists.","N/A",null,null,null,null,null,null,null,"This application is for building work that is using NZS 3604:2011 to demonstrate compliance with B1 – Structure.  Show how the bracing demand has been determined correctly to comply with section 5.1 - 5.3.",null,null,null,null,null,null,null,null,null,null,"",""]
[null,34,"Do the foundation piles comply with section 6.4? Height, materials, footings.","N/A",null,null,null,null,null,null,null,"This application is for building work that is using NZS 3604:2011 to demonstrate compliance with B1 – Structure.  Show how the sub-floor bracing design complies with section 5.5.",null,null,null,null,null,null,null,null,null,null,"",""]
[null,35,"Do the different types of piles comply with the relevant sections 6.5 – 6.9? ","N/A",null,null,null,null,null,null,null,"This application is for building work that is using NZS 3604:2011 to demonstrate compliance with B1 – Structure.  Show how the wall bracing design complies with section 5.4.",null,null,null,null,null,null,null,null,null,null,"",""]
[null,36,"Do framed sub-floor walls comply with section 6.10?","N/A",null,null,null,null,null,null,null,"This application is for building work that is using NZS 3604:2011 to demonstrate compliance with B1 – Structure.  Show how the diaphragm bracing design complies with section 5.6.",null,null,null,null,null,null,null,null,null,null,"",""]
[null,37,"Do concrete or concrete masonry walls comply with 6.11? ","N/A",null,null,null,null,null,null,null,"This application is for building work that is using NZS 3604:2011 to demonstrate compliance with B1 – Structure.  Show how the bracing design has considered section 8.3 for reinforced concrete, concrete masonry and dragon ties",null,null,null,null,null,null,null,null,null,null,"",""]
[null,38,"Do bearers comply with section 6.12?.","N/A",null,null,null,null,null,null,null,"This application is for building work that is using NZS 3604:2011 to demonstrate compliance with B1 – Structure.  Show how the sub‑floor system and the set out of the sub‑floor system comply with section 6.2. and 6.3. Consider load paths through the building and spans of bearers and floor joists",null,null,null,null,null,null,null,null,null,null,"",""]
[null,39,"Do stringers comply with section 6.13?","N/A",null,null,null,null,null,null,null,"This application is for building work that is using NZS 3604:2011 to demonstrate compliance with B1 – Structure.  Show how the foundation piles comply with section 6.4.",null,null,null,null,null,null,null,null,null,null,"",""]
[null,40,"Does the prevention of dampness measures comply with of section 6.14?","N/A",null,null,null,null,null,null,null,"This application is for building work that is using NZS 3604:2011 to demonstrate compliance with B1 – Structure.  Show how the types of foundation piles comply with section 6.5 – 6.9. See 6.5 for ordinary, 6.6 for driven timber, 6.7 for cantilevered, 6.8 for braced piles and 6.9 for anchor piles",null,null,null,null,null,null,null,null,null,null,"",""]
[null,41,"Do floor joists comply with section 7.1?","N/A",null,null,null,null,null,null,null,"This application is for building work that is using NZS 3604:2011 to demonstrate compliance with B1 – Structure.  Show how the framed sub-floor walls comply with section 6.10.",null,null,null,null,null,null,null,null,null,null,"",""]
[null,42,"Does the flooring comply with section 7.2?","N/A",null,null,null,null,null,null,null,"This application is for building work that is using NZS 3604:2011 to demonstrate compliance with B1 – Structure.  Show how the concrete or concrete masonry walls comply with section 6.11.",null,null,null,null,null,null,null,null,null,null,"",""]
[null,43,"Do flooring diaphragms comply with section 7.3?","N/A",null,null,null,null,null,null,null,"This application is for building work that is using NZS 3604:2011 to demonstrate compliance with B1 – Structure. Show how the bearers comply with section 6.12",null,null,null,null,null,null,null,null,null,null,"",""]
[null,44,"Do timber decks comply with section 7.4?","N/A",null,null,null,null,null,null,null,"This application is for building work that is using NZS 3604:2011 to demonstrate compliance with B1 – Structure.  Show how the stringers comply with section 6.13",null,null,null,null,null,null,null,null,null,null,"",""]
[null,45,"Where the design of the building includes 3kPa floor loads has the increased requirements of section 14 been met?","N/A",null,null,null,null,null,null,null,"This application is for building work that is using NZS 3604:2011 to demonstrate compliance with B1 – Structure. Show how the prevention of dampness measures comply with section 6.14",null,null,null,null,null,null,null,null,null,null,"",""]
[null,46,"Do the size limitations, ground clearances and foundation edge details of concrete floor slabs comply with sections 7.5.1 and 7.5.2?","Y","100mm concrete floor slab  - edge details sheet A15",null,null,null,null,null,null,"This application is for building work that is using NZS 3604:2011 to demonstrate compliance with B1 – Structure.  Show how the floor joists comply with section 7.1",null,null,null,null,null,null,null,null,null,null,"",""]
[null,47,"Do the granular base and DPM to concrete floor slabs comply with sections 7.5.3 – 7.5.7?","Y","DPM indicated",null,null,null,null,null,null,"This application is for building work that is using NZS 3604:2011 to demonstrate compliance with B1 – Structure.  Show how the suspended timber flooring comply with section 7.2",null,null,null,null,null,null,null,null,null,null,"",""]
[null,48,"Do the thickness, shrinkage control, bearing, support of internal walls and fixing of timber to concrete floor slabs comply with sections 7.5.8 – 7.5.12?","Y","sawcuts <6m apart",null,null,null,null,null,null,"This application is for building work that is using NZS 3604:2011 to demonstrate compliance with B1 – Structure.  Show how the flooring diaphragms comply with section 7.3",null,null,null,null,null,null,null,null,null,null,"",""]
[null,49,"Does the wall framing meet the general requirements of section 8.4 and studs in wall framing comply with section 8.5?","Y","external - 140x45 H1.2 SG8 studs @ 600 crs\ninternal - 90x45 @ 600 crs 2.7m - not sufficient\n\n13/07/17 - drawings revised to reflect 90x90 @ 400 crs","Please review the internal wall framing spacings taking into consideration the wall height of 2.7m. 90x45 @ 600mm centres does not meet the requirements of Table 8.2 NZS3604:2011.","Resolved",null,null,null,null,"This application is for building work that is using NZS 3604:2011 to demonstrate compliance with B1 – Structure.  Show how the timber decks comply with section 7.4",null,null,null,null,null,null,null,null,null,null,"",""]
[null,50,"Do lintels, sill and head trimmers comply with section 8.6?","N/A","SED",null,null,null,null,null,null,"This application is for building work that is using NZS 3604:2011 to demonstrate compliance with B1 –Show how 3 KPa floor loadings comply with section 14. Consider bracing demand, subfloor members, floor  joists, lintels, wall framing",null,null,null,null,null,null,null,null,null,null,"",""]
[null,51,"Do top and bottom plates, dwangs and ribbon boards comply with sections 8.7 and 8.8?","Y","dwangs @ 800 crs",null,null,null,null,null,null,"This application is for building work that is using NZS 3604:2011 to demonstrate compliance with B1 – Structure. Show the size limitations, ground clearances and foundation edge details of concrete floor slabs comply with sections 7.5.1 and 7.5.2",null,null,null,null,null,null,null,null,null,null,"",""]
[null,52,"Do posts comply with section 9? ","N/A",null,null,null,null,null,null,null,"This application is for building work that is using NZS 3604:2011 to demonstrate compliance with B1 – Structure. Show the granular base and DPM to concrete floor slabs comply with sections 7.5.3 – 7.5.7",null,null,null,null,null,null,null,null,null,null,"",""]
[null,53,"Does the roof framing design comply with section 10.1?","N/A","SED",null,null,null,null,null,null,"This application is for building work that is using NZS 3604:2011 to demonstrate compliance with B1 – Structure. Show the thickness, shrinkage control, bearing, support of internal walls and fixing of timber to concrete floor slabs comply with sections 7.5.8 – 7.5.12  ",null,null,null,null,null,null,null,null,null,null,"",""]
[null,54,"Do framed roofs comply with section 10.2.1  ","N/A","SED",null,null,null,null,null,null,"This application is for building work that is using NZS 3604:2011 to demonstrate compliance with B1 – Structure. Show the wall framing meet the general requirements of section 8.4 and studs in wall framing comply with section 8.5",null,null,null,null,null,null,null,null,null,null,"",""]
[null,55,"Do eaves and gable verges comply with sections 10.2.1.14 and 10.2.1.15?","Y","140x45 outriggers @ 900crs\n\n13/07/17 - detail revised to reflect 460mm overhang - cantilever <1/3 and connection details to purlins - sufficient","Detail 11 sheet A15 indicates the presence of outriggers please provide sufficient details to demonstrate compliance with B1. A roof framing plan may be appropriate which includes length of outrigger over hang and the support for the metal roofing at the eave.","Resolved",null,null,null,null,"This application is for building work that is using NZS 3604:2011 to demonstrate compliance with B1 – Structure. Show how the lintels, sill trimmers and head trimmers] in the wall framing comply with section 8.6.",null,null,null,null,null,null,null,null,null,null,"",""]
[null,56,"Do purlins and tile battens comply with section 10.2.1.16?","N/A",null,null,null,null,null,null,null,"This application is for building work that is using NZS 3604:2011 to demonstrate compliance with B1 – Structure. Show how the plates, dwangs walings and ribbon boards in the wall framing comply with sections 8.7 and 8.8",null,null,null,null,null,null,null,null,null,null,"",""]
[null,57,"Where roof construction is specific design trusses does it comply with section 10.2.2?","N/A",null,null,null,null,null,null,null,"This application is for building work that is using NZS 3604:2011 to demonstrate compliance with B1 – Structure. Show how the posts comply with section 9.",null,null,null,null,null,null,null,null,null,null,"",""]
[null,58,"Do the roof bracing systems and roof bracing details comply with sections 10.3 and 10.4?","N/A","SED",null,null,null,null,null,null,"This application is for building work that is using NZS 3604:2011 to demonstrate compliance with B1 – Structure. Show how the roof framing design complies with section 10.1.",null,null,null,null,null,null,null,null,null,null,"",""]
[null,59,"Do ceiling lining supports comply with section 13.2?","Y","70x45 ceiling battens @ 600 crs - sufficient for 21mm ply ceiling lining",null,null,null,null,null,null,"This application is for building work that is using NZS 3604:2011 to demonstrate compliance with B1 – Structure. Show that the roof framing design will comply with section 10.2.1.  Consider  rafters, ridge boards, ridge beams, ceiling joists, ceiling runners, valley boards, underpurlins, underpurlin struts, strutting beams, verandah beams, collar ties & cleats and , dummy rafters ",null,null,null,null,null,null,null,null,null,null,"",""]
[null,60,"Do openings in ceilings and support of water tanks in roof spaces comply with sections 13.3 and 13.4?","N/A",null,null,null,null,null,null,null,"This project is using NZS 3604:2011 to demonstrate compliance with B1 – Structure. Show how the eaves and gable verges comply with sections 10.2.1.14 and 10.2.1.15.",null,null,null,null,null,null,null,null,null,null,"",""]
[null,61,"Do structural ceiling diaphragms comply with section 13.5?","N/A",null,null,null,null,null,null,null,"This application is for building work that is using NZS 3604:2011 to demonstrate compliance with B1 – Structure. Show how the purlins and/or tile battens comply with section 10.2.1.16.",null,null,null,null,null,null,null,null,null,null,"",""]
[null,62,"Have all structural members subject to snow loading of up to 1.5 kPa or up to 2.0 kPa been sized and factored to tables in section 15?","N/A",null,null,null,null,null,null,null,"This project is using NZS 3604:2011 to demonstrate compliance with B1 – Structure. Show how the roof trusses comply with section 10.2.2 in relation to ",null,null,null,null,null,null,null,null,null,null,"",""]
[null,{"$f":"Z82&\"   \"&Z83","v":"B2 - DURABILITY:   "},null,null,null,null,null,null,null,null,null,"This application is for building work that is using NZS 3604:2011 to demonstrate compliance with B1 – Structure. Show the roof bracing systems and roof bracing details comply with sections 10.3 and 10.4",null,null,null,null,null,null,null,null,null,null,null,false,{"$f":"IF(X82=TRUE,TRUE,(AND(SUM(X83:X88)=0,X82=FALSE)))","v":true},"B2 - DURABILITY:"]
[null,63,"Does material compatibility comply with Tables 21 and 22, E2/AS1?","Y","specifications - no indication materials will not achieve compatibility requirements",null,null,null,null,null,null,"This project is using NZS 3604:2011 to demonstrate compliance with B1 – Structure. Show ceiling lining supports comply with section 13.2.",null,null,null,null,null,null,null,null,null,null,{"$f":"IF(D83=\"RFI\",1,\"\")","v":""},"",null,{"$f":"IF(Y85=TRUE,\"REVIEW INCOMPLETE\",\"\")","v":""},{"$f":"IF(Z83<>\"\",1,\"\")","v":""}]
[null,64,"Do woodbased building components required to achieve a 50 year durability comply with Table 1 NZS 3602:2003 as modified by B2/AS1?","Y","GSP-H elements internally\ndocumentation indicates E1 level requirement of 14.27m - evidence on file indicates property to be up to 600mm below level.\n\n13/07/17 - FFL of existing is 13.87m therefore 400mm below E1 level requirement - nib upstand of 3x 150 series blocks under load bearing (bracing) walls - average height of blocks = 190mm therefore sufficient to meet durability requirements\n- noted external wall between sliding door block wall timber and therefore will require protection from flooding\n\n31/07/17 - detail 9 sheet A4 shows lintel connection continuous from block wall to block wall therefore does not rely on studs for support","Please provide finished floor level for the addition. Whilst it is noted that the building does not need to meet the requirements of E1, it will be required to achieve compliance with 50 year durability requirements. As the internal of the building consistents of structural elements which are susceptible to the impact of moisture please provide details of how it is intended to ensure the structural integrity of these elements.\n\n13/07/17 - thank you for the revised detail for the internal walls, however it has been noted there is a timber external wall which provides some structural support and will also require protection. Please review/revise as appropriate.","Resolved",null,null,null,null,"This application is for building work that is using NZS 3604:2011 to demonstrate compliance with B1 – Structure. Show that openings in ceilings and support of water tanks in roof spaces comply with sections 13.3 and 13.4",null,null,null,null,null,null,null,null,null,null,"",{"$f":"IF(D84=\"\",1,(IF(D84=\"RFI\",1,(IF(G84=\"NOT RESOLVED\",1,\"\")))))","v":""},{"$f":"IF(X82=TRUE,\"NO NEED 1\",IF(Y82=TRUE, \"NO NEED 2\",\"NEED\"))","v":"NO NEED 2"}]
[null,65,"Do woodbased building components required to achieve a 15 year durability comply with Table 2 NZS 3602:2003 as modified by B2/AS1?","Y","H1.2  ",null,null,null,null,null,null,"This application is for building work that is using NZS 3604:2011 to demonstrate compliance with B1 – Structure. Show how the structural ceiling diaphragms comply with section 13.5.",null,null,null,null,null,null,null,null,null,null,"",{"$f":"IF(D85=\"\",1,(IF(D85=\"RFI\",1,(IF(G85=\"NOT RESOLVED\",1,\"\")))))","v":""},{"$f":"IF(Y84=\"NEED\", TRUE, FALSE)","v":false}]
[null,66,"Has an adequate coating system been specified for exposed structural steel work?","N/A",null,null,null,null,null,null,null,"This application is for building work that is using NZS 3604:2011 to demonstrate compliance with B1 – Structure. This site is subject to snow loads of [1.5 kPa, 2.0 kPa] Show how all structural members subject to snowloading will comply with section 15.",null,null,null,null,null,null,null,null,null,null,"",{"$f":"IF(D86=\"\",1,(IF(D86=\"RFI\",1,(IF(G86=\"NOT RESOLVED\",1,\"\")))))","v":""}]
[null,67,"Can maintenance be carried out as necessary to achieve the required durability of the cladding system?","Y",null,null,null,null,null,null,null,"This application is for building work that shows the use and positioning of materials that are not compatible according to Tables 21 and 22 of E2/AS1. These materials are […] shown in […]. Please revise the design or provide evidence to support the design as an alternative solution.",null,null,null,null,null,null,null,null,null,null,"",{"$f":"IF(D87=\"\",1,(IF(D87=\"RFI\",1,(IF(G87=\"NOT RESOLVED\",1,\"\")))))","v":""}]
[null,68,"Are all the products and materials new?  If not, how are the requirements of B1, B2, E2 and H1 to be satisfied? ","Y","only new products indicated",null,null,null,null,null,null,"Demonstrate compliance with B2 – Durability for  wood based building components required to achieve a 50 year durability. B2/AS1, section 3.2 provides a means of compliance",null,null,null,null,null,null,null,null,null,null,{"$f":"IF(D88=\"RFI\",1,\"\")","v":""},{"$f":"IF(D88=\"\",1,(IF(D88=\"RFI\",1,(IF(G88=\"NOT RESOLVED\",1,\"\")))))","v":""}]
[null,{"$f":"Z89&\"   \"&Z90","v":"C1 – C6 – PROTECTION FROM FIRE:   "},null,null,null,null,null,null,null,null,null,"Demonstrate compliance with B2 – Durability for  wood based building components required to achieve a 50 year durability. B2/AS1, section 3.2 provides a means of compliance",null,null,null,null,null,null,null,null,null,null,"",false,{"$f":"IF(X89=TRUE,TRUE,(AND(SUM(X90)=0,X89=FALSE)))","v":true},"C1 – C6 – PROTECTION FROM FIRE:",{"$f":"IF(Z90<>\"\",1,\"\")","v":""}]
[null,69,"Has this been covered by the fire safety specialist review on form B-151? \nIf the application include installation of a solid/liquid fuel burner, this is to be assessed by the BCO.","Y","Refer B151a",null,null,null,null,null,null,"Demonstrate compliance with B2 - Durability for wood based building components required to achieve a 15-year durability. B2/AS1, section 3.2 provides a means of compliance",null,null,null,null,null,null,null,null,null,null,"",{"$f":"IF(D90=\"\",1,(IF(D90=\"RFI\",1,(IF(G90=\"NOT RESOLVED\",1,\"\")))))","v":""},{"$f":"IF(X89=TRUE,\"NO NEED 1\",IF(Y89=TRUE, \"NO NEED 2\",\"NEED\"))","v":"NO NEED 2"},{"$f":"IF(AA90=TRUE,\"REVIEW INCOMPLETE\",\"\")","v":""},{"$f":"IF(Y90=\"NEED\", TRUE, FALSE)","v":false}]
[null,{"$f":"Z91&\"   \"&Z92","v":"D1 – ACCESS ROUTES:   "},null,null,null,null,null,null,null,null,null,"Provide details of an adequate coating system for exposed structural steel work to demonstrate compliance with B2 - Durability",null,null,null,null,null,null,null,null,null,null,null,false,{"$f":"IF(X91=TRUE,TRUE,(AND(SUM(X92:X107)=0,X91=FALSE)))","v":true},"D1 – ACCESS ROUTES:"]
[null,70,"Is there one access route that has features to enable people with disabilities to approach the building from the street boundary or, where required to be provided, the building car park, have access to the internal space served by the principal access, and have access to and within those spaces where they may be expected to work or visit, or which contain facilities for personal hygiene?","Y","East side entrance\n",null,null,null,null,null,null,"Demonstrate compliance with B2 – Durability for ensuring maintenance can be carried out as necessary to the cladding system.",null,null,null,null,null,null,null,null,null,null,"",{"$f":"IF(D92=\"\",1,(IF(D92=\"RFI\",1,(IF(G92=\"NOT RESOLVED\",1,\"\")))))","v":""},{"$f":"IF(X91=TRUE,\"NO NEED 1\",IF(Y91=TRUE, \"NO NEED 2\",\"NEED\"))","v":"NO NEED 2"},{"$f":"IF(Y93=TRUE,\"REVIEW INCOMPLETE\",\"\")","v":""},{"$f":"IF(Z92<>\"\",1,\"\")","v":""}]
[null,71,"Do access routes have adequate activity space, are free from dangerous obstructions, have a safe cross fall and safe slope in the direction of travel?","Y","1:20 ramp contrasting colour and texture\nlocated next to accessible carpark",null,null,null,null,null,null,"Demonstrate compliance with C2 - Prevention of fire occurring for the installation of a solid fuel heater.  Provide the manufacturer’s installation specifications which have been verified using AS/NZS 2918 to comply with C2.3.",null,null,null,null,null,null,null,null,null,null,"","",{"$f":"IF(Y92=\"NEED\", TRUE, FALSE)","v":false}]
[null,72,"Do access routes have adequate slip resistant walking surfaces?","Y","noted sheet A10",null,null,null,null,null,null,"Demonstrate compliance with the C clauses of the Building Code. Provide a [fire design summary, …].",null,null,null,null,null,null,null,null,null,null,"",""]
[null,73,"Do access routes include stairs to upper floors, have stair treads that provide adequate footing, have an uniform rise, treads that can be easily seen and prevent children becoming trapped and appropriate landings?","N/A",null,null,null,null,null,null,null,"Demonstrate compliance with D1.3.2 for the provision of an access routes that has features to enable people with disabilities to: approach the building from the street boundary or, where required to be provided, the building car park; have access to the internal space served by the principal access; and have access to and within those spaces where they may be expected to work or visit, or which contain facilities for personal hygiene.. Section 1, D1/AS1 and section 4 NZS4121 provides a means of compliance.",null,null,null,null,null,null,null,null,null,null,"",""]
[null,74,"Do access routes contain no isolated steps?","Y","no levels where change indicated\ndetail indicates channel drain 100mm below entrance - noted not accessible entrance\n\n13/07/17 \n1. FFL for both existing and proposed provided indicating same level\n2. Detail revised to reflect 2 steps, however 120mm riser not within scope of AS1\n\n31/07/17 - steps revised to 150mm riser, 345 depth now within scope\n\n02/08/17 - noted that now has two risers therefore handrail required\n\n15/08/17 - entry revised to reflect level entry, strip drain details provided, also noted that paved surface outside entrance graded to 1:50 over parking area to boundary provided - sufficient to meet requirements","1. Please provide finished floor level between the existing and new floors sufficient to demonstrate compliance with the requirement of D1 in relation to isolated steps. RESOLVED\n\n2. Please review detail 18 sheet A16. The installation of the channel drain 100mm below the finished floor level and also door sill indicates the presence of an isolated step at this entrance which does not comply with the requirements of D1.\n\n13/07/17 - Thank you for the revised detail, however the dimensions provide are not within the scope of D1/AS1 4.1.1 and figure 11 ie risers of less than 150mm (less than 23 degree pitch) are not acceptable - Please review as appropriate. For this to be reviewed as an alterntive solution sufficient information to demonstrate compliance with D1 will be required.\n\n02/08/17 - Thank you for the details, however as you have indicated two risers please provide the details of the handrail sufficient to demonstrate compliance with the requirements of D1.3.2(K).","Resolved",null,null,null,null,"Demonstrate compliance with D1 for access routes. Show that they have adequate activity space, are free from dangerous obstructions, have a safe cross fall, a safe slope in the direction of travel. See Section 1 & 3, D1/AS1 provides a means of compliance.",null,null,null,null,null,null,null,null,null,null,"",""]
[null,75,"Do access routes have adequate handrails to assist movement on stairs and ladders.","N/A",null,null,null,null,null,null,null,"Demonstrate compliance with D1 for access routes. Show that they have adequate slip resistant walking surfaces. See Section 2, D1/AS1 provides a means of compliance.",null,null,null,null,null,null,null,null,null,null,"",""]
[null,76,"Does the accessible route in addition to the requirements of an access route have adequate activity space to enable a person in a wheelchair to negotiate the route while permitting an ambulant person to pass?","Y","1200mm width",null,null,null,null,null,null,"Demonstrate compliance with D1 for stairs to upper floors. Show that they provide adequate footing, have a uniform rise, have treads that can be easily seen, prevent children becoming trapped, have appropriate landings. Sections 4 & 5, D1/AS1 provides a means of compliance",null,null,null,null,null,null,null,null,null,null,"",""]
[null,77,"Do ramps including kerb and step ramps meet the requirements of an accessible route?","Y","ramp 1:20 slope - 2.86 degrees\n75mm upstand",null,null,null,null,null,null,"Demonstrate compliance with D1.3.3(i). Access routes shall not contain isolated steps. ",null,null,null,null,null,null,null,null,null,null,"",""]
[null,78,"Do entrances, corridors, doorways and doors meet the requirements of an accessible route?","Y","no detail for accessible entrance - door opening outwards\nnote on proposed floor plan threshold max 20mm\nlanding/level 2.0m \n930mm width\ncorridor 1200 wide\nhardware as per sheet A10\n\n13/07/17 - additional detail provided 25 sheet A22 - sufficient","Please provide a sill detail for door indicated on the East side of the addition sufficient to demonstrate compliance with the requirements of D1 and E2 in relation to accessible route.","Resolved",null,null,null,null,"Demonstrate compliance with D1 for handrails to assist movement on stairs and ladders. Section 6, D1/AS1 provides a means of compliance.",null,null,null,null,null,null,null,null,null,null,"",""]
[null,79,"Does the building have at least one stairway leading off an accessible route whether or not a lift is provided that meets the requirements of an accessible stairway?","N/A",null,null,null,null,null,null,null,"Demonstrate compliance with D1 for the accessible route. Show that the accessible route has adequate activity space to enable a person in a wheelchair to negotiate the route while permitting an ambulant person to pass. Sections 2.2 & 3.2, D1/AS1 and section 4, NZS4121 provide means of compliance",null,null,null,null,null,null,null,null,null,null,"",""]
[null,80,"Where required, are handrails on both sides of the accessible route and continuous along both sides of the stair, ramp and landing except where the handrail is interrupted by a doorway?","N/A",null,null,null,null,null,null,null,"Demonstrate compliance with D1 for ramps including kerb and step ramps on accessible routes. Section 3, D1/AS1, Section 6, NZS 4121 provides a means of compliance",null,null,null,null,null,null,null,null,null,null,"",""]
[null,81,"Is this a building where a lift complying with Clause D2 to upper floors is required?.","N/A","single storey addition only",null,null,null,null,null,null,"Demonstrate compliance with D1 for entrances, corridors, doorways and doors on accessible routes. Section 7, D1/AS1, Section 7, NZS4121 provides a means of compliance",null,null,null,null,null,null,null,null,null,null,"",""]
[null,82,"Do places of assembly, entertainment and recreation meet the requirements for accessible routes?","N/A",null,null,null,null,null,null,null,"Demonstrate compliance with D1 for stairs on the accessible route.  Show the building have at least one stairway leading off an accessible route whether or not a lift is provided that meets the requirements of an accessible stairway.  Section 4 ,D1/AS1 and  Section 8, NZS4121 provide means of compliance ",null,null,null,null,null,null,null,null,null,null,"",""]
[null,83,"Where required, are there sufficient accessible accommodation units provided that meet the requirements for access and facilities for persons with disabilities?","N/A",null,null,null,null,null,null,null,"Demonstrate compliance with D1 for handrails on the accessible route. Show handrails on both sides of the accessible route and continuous along both sides of the stair, ramp and landing except where the handrail is interrupted by a doorway.  Section 6, D1/AS1, Section 8.6, NZS4121 provide a means of compliance",null,null,null,null,null,null,null,null,null,null,"",""]
[null,84,"Do vehicle spaces have appropriate dimensions and cross falls and adequate queuing, circulation space and sight distances?","Y","consistent with AS1",null,null,null,null,null,null,"Demonstrate compliance with D1.3.4 (c) that the building includes a lift complying with Clause D2 to upper floors.   Section 12, D1/AS1 and section 9, NZS 4121 provide means of compliance.",null,null,null,null,null,null,null,null,null,null,"",""]
[null,85,"Are vehicle spaces for use by people with disabilities in addition to the requirements of Clause D1.3.5 provided in sufficient numbers, located to avoid conflict between vehicles and people using or moving to or from the space, and easy to find as required by Clause F8 Signs?","Y","3500 wide, 5400 deep",null,null,null,null,null,null,"Demonstrate compliance with D1 for the accessible route to places of assembly, entertainment and recreation. Section 8 D1/AS1 and NZS4121, Section 12 provide means of compliance",null,null,null,null,null,null,null,null,null,null,"",""]
[null,{"$f":"Z108&\"   \"&Z109","v":"D2 – MECHANICAL INSTALLATION FOR ACCESS:   "},null,null,null,null,null,null,null,null,null,"Demonstrate compliance with D1 for the accessible route to accommodation units. Section 9, D1/AS1 and Section 14, NZS4121 provide a means of compliance.",null,null,null,null,null,null,null,null,null,null,"",true,{"$f":"IF(X108=TRUE,TRUE,(AND(SUM(X109:X110)=0,X108=FALSE)))","v":true},"D2 – MECHANICAL INSTALLATION FOR ACCESS:"]
[null,86,"Where applicable do mechanical installation for access comply with D2.3.1, D2.3.2, D2.3.3 and D2.3.4? \nList type/means of compliance/installer/manfacturer/model",null,null,null,null,null,null,null,null,"Demonstrate compliance with D1.3.5 for vehicle parking spaces. Show that vehicle spaces have appropriate dimensions and cross falls and adequate queuing, circulation space and sight distances.  Section 10, D1/AS1 provides a means of compliance. ",null,null,null,null,null,null,null,null,null,null,"",{"$f":"IF(D109=\"\",1,(IF(D109=\"RFI\",1,(IF(G109=\"NOT RESOLVED\",1,\"\")))))","v":1},{"$f":"IF(X108=TRUE,\"NO NEED 1\",IF(Y108=TRUE, \"NO NEED 2\",\"NEED\"))","v":"NO NEED 1"},{"$f":"IF(Y110=TRUE,\"REVIEW INCOMPLETE\",\"\")","v":""},{"$f":"IF(Z109<>\"\",1,\"\")","v":""}]
[null,87,"Do mechanical installations on an accessible route comply with D2.3.5?",null,null,null,null,null,null,null,null,"Demonstrate compliance with D1.3.6 for accessible vehicle parking spaces.  Show that vehicle spaces for use by people with disabilities in addition to the requirements of Clause D1.3.5 are provided in sufficient numbers, located to avoid conflict between vehicles and people using or moving to or from the space, and easy to find as required by Clause F8 Signs.   Section 10, D1/AS1 and section 5, NZS4121 provide a means of compliance",null,null,null,null,null,null,null,null,null,null,"",{"$f":"IF(D110=\"\",1,(IF(D110=\"RFI\",1,(IF(G110=\"NOT RESOLVED\",1,\"\")))))","v":1},{"$f":"IF(Y109=\"NEED\", TRUE, FALSE)","v":false}]
[null,{"$f":"Z111&\"   \"&Z112","v":"E1 – SURFACE WATER:   "},null,null,null,null,null,null,null,null,null,"Demonstrate compliance with building code performance clause D2 for the mechanical installation for access",null,null,null,null,null,null,null,null,null,null,null,false,{"$f":"IF(X111=TRUE,TRUE,(AND(SUM(X112:X119)=0,X111=FALSE)))","v":true},"E1 – SURFACE WATER:"]
[null,88,"Where compliance is being shown with an alternative solution or SED to E1/VM1 has this been covered by a civil specialist review.","Y","Review by Donnick Mugusto",null,null,null,null,null,null,"Demonstrate compliance with D2 for mechanical installations on an accessible route. Show how the lift meets the requirements of D2.3.5. D2/AS1 and Section 9, NZS4121 provides a means of compliance.",null,null,null,null,null,null,null,null,null,null,"",{"$f":"IF(D112=\"\",1,(IF(D112=\"RFI\",1,(IF(G112=\"NOT RESOLVED\",1,\"\")))))","v":""},{"$f":"IF(X111=TRUE,\"NO NEED 1\",IF(Y111=TRUE, \"NO NEED 2\",\"NEED\"))","v":"NO NEED 2"},{"$f":"IF(Y113=TRUE,\"REVIEW INCOMPLETE\",\"\")","v":""},{"$f":"IF(Z112<>\"\",1,\"\")","v":""}]
[null,89,"Are floor levels above the minimum required by the PIM/Development Report or Section 2, E1/AS1 to establish compliance with E1.3.2?","Y",null,"Please provide FFL and the ground to  floor separation. 13/07/2017 Resolved See TRIM 17/741973","Resolved",null,null,null,null,null,null,null,null,null,null,null,null,null,null,null,"","",{"$f":"IF(Y112=\"NEED\", TRUE, FALSE)","v":false}]
[null,90,"Is there an approved stormwater outfall identified?","Y",null,"• Authorisation For The Discharge Of Stormwater Into CCC Network: To comply with the New Zealand Building Code stormwater discharge from this property must avoid the likelihood of damage to the outfall in a manner acceptable to the Council’s Assets And Network Unit. In addition, the Council requires stormwater discharge compliance with Environment Canterbury’s regional rules and holds a number of discharge consents throughout its territory which it may use to authorise the discharge of stormwater into its network. Compliance with relevant consent conditions may require onsite stormwater mitigation (treatment and/or attenuation/disposal). Before a Building Consent can be issued you must seek authorisation from Council’s Assets And Network Unit by contacting Stormwater.Approvals@ccc.govt.nz. If Council does not authorise the stormwater discharge under one of its global consents, separate authorisation from Environment Canterbury may be required prior to a Building Consent being issued. The obtained authorisation must be included with the supporting documents of your building consent application.  13/07/2017 Resolved See TRIM 17/363256","Resolved",null,null,null,null,"Compliance with E1 - Surface water will be assessed by a specialist reviewer and may generate further questions.",null,null,null,null,null,null,null,null,null,null,"",""]
[null,91,"Has a layout of drainage to convey surface water to an appropriate outfall been provided, with sufficient details of pipe sizes, gradients, access points, invert levels and capacity of existing system, to establish compliance with E1.3.3?","Y",null,"Please provide the grade and pipe size  of the existing stormwater pipe to be disconnected so that the adequacy of the proposed design draining the additional proposed building can be ascertained. In addition please provide the pipe grade of the proposed stormwater pipe on drawing A4. 13/07/2017 Resolved See TRIM 17/741973","Resolved",null,null,null,null,"Demonstrate compliance with E1.3.2 for minimum floor levels. Council flood modelling data shows a minimum floor level of […] relative to Council datum is required to prevent surface water from an 1 in 50-year event entering the building.",null,null,null,null,null,null,null,null,null,null,"",""]
[null,92,"Has the implications of trenches close to buildings and drains under buildings been considered?","N/A",null,null,null,null,null,null,null,"As indicated in the PIM, approval is needed for the proposed stormwater outfall. Contact [council department, ECan].  ",null,null,null,null,null,null,null,null,null,null,"",""]
[null,93,"Have adequate details of surface water control for paved areas been provided?","N/A","no new areas",null,null,null,null,null,null,"Provide a drainage layout plan to show how surface water is conveyed to an appropriate outfall, with sufficient details of pipe sizes, gradients, access points, invert levels and the capacity of the existing system, to establish compliance with E1.3.3.  ",null,null,null,null,null,null,null,null,null,null,"",""]
[null,94,"Have details of sufficient down pipes at an adequate size been provided? ","Y","Proposed 100mm dia downpipe to drain 105m^2 at 5 degree pitch is adequate.",null,null,null,null,null,null,"Demonstrate compliance with B1 and E1 for trenches close to buildings and drains under buildings. Sections 3.7.6 and 3.9.7 and Fig 14, E1/AS1 provide means of compliance.",null,null,null,null,null,null,null,null,null,null,"",""]
[null,95,"Have the internal and external gutters been adequately sized and is there adequate provision for overflow from internal gutters? ","Y","Proposed 42,000mm^2 cross section internal gutter is adequate to drain 105m^2 at 5 degree pitch","Please provide the size of the proposed overflows on drawing A19  13/07/2017 Resolved See TRIM 17/741973","Resolved",null,null,null,null,"Demonstrate compliance with E1 for draining surface water from paved areas. Provide details of surface water being disposed of in way that a 1 in 10 year event avoids the likelihood of damage or nuisance to other property. ",null,null,null,null,null,null,null,null,null,null,"",""]
[null,{"$f":"Z120&\"   \"&Z124","v":"E2 – EXTERNAL MOISTURE:     "},null,null,null,null,null,null,null,null,null,"Demonstrate compliance with E1 for the number and size of downpipes provided. Table 5, E1/AS1 provides a means of compliance",null,null,null,null,null,null,null,null,null,null,null,false,{"$f":"IF(X120=TRUE,TRUE,IF(SUM(X121:X126)>0,FALSE,TRUE))","v":true},"E2 – EXTERNAL MOISTURE:  "]
[null,96,"Is the building design within the scope of the acceptable solutions to E2?\nList applicable acceptable solutions and provide comment if appropriate\n• E2/AS1\n• E2/AS2 – Earth buildings\n• E2/AS3 -  Concrete and concrete masonry buildings ","Y","E2/AS1 and E2/AS3",null,null,null,null,null,null,"Demonstrate compliance with E1 for the [internal, external] gutters and provision of overflow from the internal gutters. Section 5, E1/AS1 provides a means of compliance.",null,null,null,null,null,null,null,null,null,null,"",{"$f":"IF(D121=\"\",1,(IF(D121=\"RFI\",1,(IF(G121=\"NOT RESOLVED\",1,\"\")))))","v":""},{"$f":"IF(X120=TRUE,TRUE,IF(Y120=TRUE,TRUE,FALSE))","v":true},{"$f":"IF(Y121=FALSE,\"REVIEW INCOMPLETE\",\"\")","v":""}]
[null,97,"Is the roof cladding system within the limitations of E2/AS1 and does it comply with the relevant section?\nList applicable cladding system and provide comment if appropriate\n• Masonry tiles (section 8.2)\n• Pressed metal tiles (section 8.3)\n• Profiled metal roof claddings (section 8.4)\n• Membrane roofing (section 8.5) ","Y","long run metal roof cladding (Endura) no profile details @ 5 degree roof pitch - Dimond Topspan profile, hirib roofing profile indicated in specifications - sufficient",null,null,null,null,null,null,"This application has identified that second hand materials are intended to be used in part or all the project. Before second hand materials can be approved, evidence needs to be provided to demonstrate how the provisions of Building Code clauses B1, B2, E2 and H1 can be satisfied. This may require some testing and/or inspections to be carried out by an expert in that particular field.",null,null,null,null,null,null,null,null,null,null,"","",null,{"$f":"AND(Z121=\"\",Z127=\"\")","v":true}]
[null,98,"Is the wall cladding system within the limitations of E2/AS1 and does it comply with the relevant section?\nList applicable cladding system and provide comment if appropriate\n• Masonry veneer (section 9.2)\n• Stucco (section 9.3)\n• Timber weatherboard (section 9.4)\n• Fibre Cement Weatherboard (section 9.5)\n• Profiled Metal Wall Cladding (section 9.6)\n• Fibre Cement Sheet (section 9.7)\n• Plywood Sheet (section 9.8)\n• EIFS (section 9.9)","Y","Dimond rib50 profiles metal roof cladding - vertical direct fixed\n\n150 series blockwall to AS3\nsupervisor - confirm is it sufficient for painting information in specs\n\n13/07/17 - additional supp docs for StoClear coating systems","Please note on elevations the surface finish for the blockwalls sufficient to demonstrate compliance with the requirements of E2.","Resolved",null,null,null,null,"This application is for building work that is outside the scope of E2/[AS1, AS2, AS3].  Buildings, components or junction details not included or shown in this Acceptable Solution require specific design and requires assessment as an alternative solution ",null,null,null,null,null,null,null,null,null,null,"","",null,{"$f":"IF(Z122=FALSE,\"REVIEW INCOMPLETE\",\"\")","v":""}]
[null,99,"Are alternative solutions for compliance with E2 being used for roof or wall cladding systems?\nList applicable cladding system and provide comment\n• Proprietary torch on membranes\n• Proprietary lightweight cladding\n• Proprietary AAC panel system\n• Other","N/A",null,null,null,null,null,null,null,"Demonstrate compliance with E2 for the roof cladding system of [masonry tiles, pressed metal tiles, profiled metal roof cladding, membrane roofing] Section 8, E2/AS1 provides a means of compliance.",null,null,null,null,null,null,null,null,null,null,"","",null,{"$f":"IF(X120=TRUE,\"\",Z123)","v":""},{"$f":"IF(Z124<>\"\",1,\"\")","v":""}]
[null,100,"Have details not covered in E2/AS1 been assessed to comply with the performance requirements of E2?\nList applicable alternative solution and provide comment\n• Junctions between different types of claddings\n• Skillion roofs\n• Timber framed windows/doors\n• Basements (note removed from E2/AS1 amendment 5)\n• Other","Y","no cladding details provided.\n\n13/07/17 \n1. horizontaljunction of vertical Rib50 metal to block sheet A15 sufficient, internal junction existing metal to block A22\n2. noted junctions via metal flashing which have some flexibility for movement - continues to maintain requirements of E2.\n\n\n31/07/17\n1. cladding removed from within seismic separation space\n2. blocking removed from within seismic separation space\n3. detail provided with Fosroc MS sealant indicated on PEF rod - for supervisor does this need to be firerated - check with structure and fire\n\n02/08/17 \nstructure - wall is structural therefore seismic separation of 50mm is required\nfire - as total area of gap (3.5mx0.050m) is greater than 0.1m² it will need to be fire rated.\n\n15/08/17 - note provided indicating from structural engineer which advises that requirements for wall will be achieved with only 10mm seismic separation - discussed with Rolando Basobas who advised sufficient/reasonable - 10mm gap does not provide area greater than 0.1m² therefore no fire rating required. Intended for area to have surface coating to seal block therefore gap will have sealant and coating seal - sufficient for E2.","1. Please provide cladding details for all junctions sufficient to demonstrate compliance with requirements of E2. This should include but is not limited to the vertical metal cladding to blockwall both vertical junction and internal corner and internal corner for existing metal cladding to new block wall. RESOLVED\n\n2. If it is intended to have the new element structurally seismically separate from the existing building (as identified in the structural engineers design features report), please provide details for the junctions between the new and existing walls sufficient to demonstrate compliance with the requirements of E2.\n\n13/07/17 - Thank you for the additional details. Please review detail 23 Sheet A22. It appears the existing metal wall cladding is shown as continuous within the seismic gap required. Also Detail 24 same sheet indicates the presence of blocking within this seismic gap. Please remove from details to ensure full depth of seismic separation is maintained. RESOLVED\n\n13/07/17 - NEW - please provide a detail for the junction between existing block wall and new blockwall located on the boundary - this detail should reflect the requirement for seismic separation that has been indicated throughout consent documents. Note detail 7 will need to be revised to reflect this requirement and to remove the metal cladding indicated within the seismic gap.\n\n02/08/17 - Thank you for the details provided, however please review detail 28 sheet A22. The gap between the new and existing blockwall is shown to be only 10mm, whereas there is a requirement for 50mm seismic separation. As these are both structural elements the 50mm separation is required to be maintained in this location. Note that as the gap will now exceed 0.1m² (3.5x0.050m) this gap will need to be firerated to the same rating as the wall which is shown to be 120 minute FRR.","Resolved",null,null,null,null,"Demonstrate compliance with E2 for the wall cladding system of [masonry veneer, stucco, timber weatherboard, fibre cement weatherboard, profiled metal wall cladding, fibre cement sheet, plywood sheet, EIFS]  Section 9, E2/AS1 provides a means of compliance",null,null,null,null,null,null,null,null,null,null,"",""]
[null,101,"Is there provision for preventing the ingress of snow melt water?","N/A",null,null,null,null,null,null,null,"Demonstrate compliance with E2 for the following alternative solution cladding. […]Provide supporting information that this cladding has been assessed to comply as an alternative solution.",null,null,null,null,null,null,null,null,null,null,"",""]
[null,"E2 / AS1:",null,null,null,null,null,null,null,null,null,"Demonstrate compliance with E2 for the following alternative solution weather tightness detail […] Provide supporting information that this weather tightness detail has been assessed to comply as an alternative solution",null,null,null,null,null,null,null,null,null,null,null,false,{"$f":"AND(X127=FALSE,SUM(X128:X141)>0)","v":false},{"$f":"IF(Y127=TRUE,\"REVIEW INCOMPLETE\",\"\")","v":""}]
[null,102,"Has a risk matrix score using section 3 been provided for elevations using acceptable solution wall cladding systems?","N/A",null,null,null,null,null,null,null,"Demonstrate compliance with E2.3.1 for the roof design. Provide details of provision for preventing the ingress of snow melt water.  ",null,null,null,null,null,null,null,null,null,null,"",{"$f":"IF(D128=\"\",1,(IF(D128=\"RFI\",1,(IF(G128=\"NOT RESOLVED\",1,\"\")))))","v":""}]
[null,103,"Do flashings details comply with the general requirements of section 4?","Y","13/07/17\n1. apron flashing detail provided A22\n2. additional details provided A23\n3. confirmation the existing external poles will be removed prior to construction - not structural element\n","1. Please provide apron flashing detail for where existing vertical metal wall cladding junctions with new metal roof cladding sufficient to demonstrate compliance with the requirements of E2 and taking into consideration the seismic separation of the new and existing building if appropriate.\n\n2. Please provide rainwater head penetration detail sufficient to demonstrate compliance with the requirements of E2.\n\n3. The North elevation indicates the potential for a clash between the existing external steel (braced) poles and the eave to the east elevation. Please provide sufficient detail to demonstrate compliance with the requirements of E2 at this location.","Resolved",null,null,null,null,null,null,null,null,null,null,null,null,null,null,null,"",""]
[null,104,"Do roof/wall junction details comply with the general requirements of section 5?","Y","13/07/17\n1. detail revised A15 - sufficient\n2. revised details provided","1. Please provide wall to soffit junction for the raking soffit (greater than 90 degree eave) sufficient to demonstrate compliance with the requirements of E2.\n\n2. Please provide barge detail for junction with both blockwall and vertical metal wall cladding sufficient to demonstrate compliance with the requirements of E2.","Resolved",null,null,null,null,"Provide a risk matrix assessment using section 3, E2/AS1 for all elevations ",null,null,null,null,null,null,null,null,null,null,"",""]
[null,105,"Do parapet details comply with the general requirements of section 6?","Y","metal cap flashing - 5 degree pitch",null,null,null,null,null,null,"Provide flashing details  that will comply with section 4, E2/AS1 ",null,null,null,null,null,null,null,null,null,null,"",""]
[null,106,"Do decks and pergolas attached to the building comply with the general requirements of section 7?","N/A",null,null,null,null,null,null,null,"Provide roof/wall junction that will comply with section 5, E2AS1",null,null,null,null,null,null,null,null,null,null,"",""]
[null,107,"Does the roof underlay comply with the general requirements of section 8.1.5?","Y","Fastwrap Flamespec SS - specifications",null,null,null,null,null,null,"Provide parapet details that will comply with section 6, E2/AS1.",null,null,null,null,null,null,null,null,null,null,"",""]
[null,108,"Do internal, valley and hidden gutters comply with the general requirements of section 8.1.6 E2/AS1?","Y","Detail 1 sheet A13 - does not show materials, height of metal gutter cladding etc\n\n13/07/17 - additional details provided A23 - sufficient","Please provide internal gutter detail which indicates extent and all material layers sufficient to demonstrate compliance with the requirements of E2.","Resolved",null,null,null,null,"Provide details of the deck and pergola attached to the building that will comply with section 7, E2/AS1.",null,null,null,null,null,null,null,null,null,null,"",""]
[null,109,"Do roof penetration details comply with the general requirements of section 8.1.7, E2/AS1?","Y","13/07/17 \n1. skylight details provided A20\n2. pipe penetration detail A19","1. Please review skylight penetration detail A sheet A20. It appears to reflect skylight located near roof edge (barge) which is not applicable for this application. The drawings appear to suggest the use of a diverter/cricket flashing which there has been no details provided.\n\n2. Please provide pipe roof penetration detail for the terminal vent pentration indicated on sheet A19 sufficient to demonstrate compliance with the requirements of E2.","Resolved",null,null,null,null,"Provide details of the roof underlay to comply with section 8.1.5, E2/AS1.",null,null,null,null,null,null,null,null,null,null,"",""]
[null,110,"Does the bottom of wall cladding comply with the general requirements of section 9.1.3?","Y",null,null,null,null,null,null,null,"Provide details of the internal, valley and hidden gutters to comply with section 8.1.6, E2/AS1",null,null,null,null,null,null,null,null,null,null,"",""]
[null,111,"Do barriers to airflow, wall openings, air seals and building wrap comply with the general requirements of sections 9.1.4 – 9.1.7?","Y","Fastwrap  - specifications",null,null,null,null,null,null,"Provide details of roof penetrations to comply with section 8.1.7, E2/AS1.",null,null,null,null,null,null,null,null,null,null,"",""]
[null,112,"Do drained cavities comply with the general requirements of section 9.1.8?","N/A",null,null,null,null,null,null,null,"Provide details of bottom of the wall cladding to comply with section 9.1.3, E2/AS1.",null,null,null,null,null,null,null,null,null,null,"",""]
[null,113,"Do wall penetrations comply with the general requirements of section 9.1.9?","N/A",null,null,null,null,null,null,null,"Provide details of the barriers to airflow, wall openings, air seals and building wrap to comply with sections 9.1.4 to 9.1.7, E2/AS1.",null,null,null,null,null,null,null,null,null,null,"",""]
[null,114,"Do windows and doors comply with the general requirements of section 9.1.10?","Y","door sill detail for accessible refer D1 Q78\n\n13/07/17 \n1. sill detail revised to reflect membrane sufficient\n2. saw cut added to head detail for drip edge","1. Please confirm that the membrane extends beyond the blockwall window sill sufficient to demonstrate compliance with the requirements of E2.\n\n2. Please review the head flashing detail for the block wall penetrations sufficient to demonstrate compliance with the requirements of E2. ie no drip edge provided.","Resolved",null,null,null,null,"Provide details of the drained cavities to comply with section 9.1.8, E2/AS1.",null,null,null,null,null,null,null,null,null,null,"",""]
[null,115,"Has the potential for unacceptable construction moisture been assessed with section 10?","Y","specifications",null,null,null,null,null,null,"Provide details  of the wall penetrations to comply with section 9.1.9, E2/AS1.",null,null,null,null,null,null,null,null,null,null,"",""]
[null,{"$f":"Z142&\"   \"&Z143","v":"E3 – INTERNAL MOISTURE:   "},null,null,null,null,null,null,null,null,null,"Provide window and door opening details to comply with section 9.1.10, E2/AS1.",null,null,null,null,null,null,null,null,null,null,null,false,{"$f":"IF(X142=TRUE,TRUE,(AND(SUM(X143:X146)=0,X142=FALSE)))","v":true},"E3 – INTERNAL MOISTURE:"]
[null,116,"Have details of an adequate combination of thermal resistance, ventilation, and space temperature been provided?","Y",null,null,null,null,null,null,null,"Provide details of measures to ensure construction moisture will comply with section 10, E2/AS1 ",null,null,null,null,null,null,null,null,null,null,"",{"$f":"IF(D143=\"\",1,(IF(D143=\"RFI\",1,(IF(G143=\"NOT RESOLVED\",1,\"\")))))","v":""},{"$f":"IF(X142=TRUE,\"NO NEED 1\",IF(Y142=TRUE, \"NO NEED 2\",\"NEED\"))","v":"NO NEED 2"},{"$f":"IF(Y144=TRUE,\"REVIEW INCOMPLETE\",\"\")","v":""},{"$f":"IF(Z143<>\"\",1,\"\")","v":""}]
[null,117,"Has provision been made where accidental overflow could damage an adjoining household unit?","N/A",null,null,null,null,null,null,null,"Demonstrate compliance with E3.3.1 by providing details of an adequate combination of thermal resistance, ventilation and space temperature.  Section1, E3/AS1 provides a means of compliance",null,null,null,null,null,null,null,null,null,null,"",{"$f":"IF(D144=\"\",1,(IF(D144=\"RFI\",1,(IF(G144=\"NOT RESOLVED\",1,\"\")))))","v":""},{"$f":"IF(Y143=\"NEED\", TRUE, FALSE)","v":false}]
[null,118,"Have details been provided for surfaces to be impervious, easily cleaned and will prevent water penetration into concealed spaces where adjacent to sanitary fixtures and appliances or likely to be splashed?","Y","10mm GIB aqualine with paint finish\nWCs only",null,null,null,null,null,null,"Where steel structure has been used in this building envelope show that an adequate thermal break will be provided.",null,null,null,null,null,null,null,null,null,null,"",{"$f":"IF(D145=\"\",1,(IF(D145=\"RFI\",1,(IF(G145=\"NOT RESOLVED\",1,\"\")))))","v":""}]
[null,119,"Where level access showers and/or tiled shower enclosures are proposed, have sufficient details of gradients to floor, substrates, surface finishes and tanking membrane been provided?","N/A",null,null,null,null,null,null,null,"Demonstrate compliance with E3.3.2 by providing a means of preventing  accidental overflow of water causing damage to an adjoining household unit   Section 2, E3/AS1",null,null,null,null,null,null,null,null,null,null,"",{"$f":"IF(D146=\"\",1,(IF(D146=\"RFI\",1,(IF(G146=\"NOT RESOLVED\",1,\"\")))))","v":""}]
[null,{"$f":"Z147&\" \"&Z148","v":"F1 – HAZARDOUS AGENTS ON SITE: "},null,null,null,null,null,null,null,null,null,"Demonstrate compliance with E3 by providing details of surfaces where adjacent to sanitary fixtures and appliances or likely to be splashed which are required to be impervious, easily cleaned and prevent water penetration into concealed spaces..",null,null,null,null,null,null,null,null,null,null,null,false,{"$f":"IF(X148=1,FALSE,TRUE)","v":true},"F1 – HAZARDOUS AGENTS ON SITE:"]
[null,120,"Where it is likely hazardous agents and contaminates are on the site has advice input been provided by the Environmental Health Team to establish compliance with F1.3.1 and F1.3.2?","N/A",null,null,null,null,null,null,null,"Demonstrate compliance with E3 by providing details of the proposed level access showers and/or tiled shower enclosures .  Provide sufficient details of gradients to floor, substrates, surface finishes and tanking membrane to establish compliance",null,null,null,null,null,null,null,null,null,null,{"$f":"IF(D148=\"RFI\",1,\"\")","v":""},{"$f":"IF(D148=\"\",1,(IF(D148=\"RFI\",1,(IF(G148=\"NOT RESOLVED\",1,\"\")))))","v":""},{"$f":"IF(X147=TRUE,TRUE,Y147)","v":true},{"$f":"IF(Y148=FALSE,\"REVIEW INCOMPLETE\",\"\")","v":""},{"$f":"IF(Z148<>\"\",1,\"\")","v":""}]
[null,{"$f":"Z149&\"   \"&Z150","v":"F2 – HAZARDOUS BUILDING MATERIALS:   "},null,null,null,null,null,null,null,null,null,"As our records show this site is likely to have hazardous agents and contaminates, demonstrate compliance with building code performance clauses; F1.3.1 and F1.3.2",null,null,null,null,null,null,null,null,null,null,null,false,{"$f":"IF(X149=TRUE,TRUE,(AND(SUM(X150:X152)=0,X149=FALSE)))","v":true},"F2 – HAZARDOUS BUILDING MATERIALS:"]
[null,121,"Has sufficient details been provided to ensure Grade A safety glazing will be used where required by NZS 4223 Part 3 as modified by F2/AS1?","Y","noted no glazing to wetares",null,null,null,null,null,null,null,null,null,null,null,null,null,null,null,null,null,"",{"$f":"IF(D150=\"\",1,(IF(D150=\"RFI\",1,(IF(G150=\"NOT RESOLVED\",1,\"\")))))","v":""},{"$f":"IF(X149=TRUE,\"NO NEED 1\",IF(Y149=TRUE, \"NO NEED 2\",\"NEED\"))","v":"NO NEED 2"},{"$f":"IF(Y151=TRUE,\"REVIEW INCOMPLETE\",\"\")","v":""},{"$f":"IF(Z150<>\"\",1,\"\")","v":""}]
[null,122,"Has sufficient details been provided to ensure manifestation is applied to glazing capable of being mistaken for an unimpeded path of travel?","Y","doors have transom bars\nsidelights full length no transoms\n\n13/07/17 - door type revised transoms now present","Please confirm the presence of manifestation to glazing panels capable of being mistaken for an unimpeded path sufficient to demonstrate compliance with the requirements of F2 ie side panels for sliding doors.","Resolved",null,null,null,null,null,null,null,null,null,null,null,null,null,null,null,"",{"$f":"IF(D151=\"\",1,(IF(D151=\"RFI\",1,(IF(G151=\"NOT RESOLVED\",1,\"\")))))","v":""},{"$f":"IF(Y150=\"NEED\", TRUE, FALSE)","v":false}]
[null,123,"Has an investigation been done and/or a procedure plan been submitted for existing buildings where it is reasonably likely asbestos in a potentially hazardous form will be disturbed by the proposed building work?","N/A",null,null,null,null,null,null,null,"Demonstrate compliance with F2 for glazing by showing on the elevations or window schedule which windows require Grade A safety glazing in accordance with  NZS 4223 Part 3 as modified by F2/AS1.",null,null,null,null,null,null,null,null,null,null,"",{"$f":"IF(D152=\"\",1,(IF(D152=\"RFI\",1,(IF(G152=\"NOT RESOLVED\",1,\"\")))))","v":""}]
[null,{"$f":"Z153&\" \"&Z154","v":"F3 – HAZARDOUS SUBSTANCES AND PROCESSES: "},null,null,null,null,null,null,null,null,null,"Demonstrate compliance with F2 by providing sufficient details of manifestation applied to glazing capable of being mistaken for an unimpeded path of travel. Refer to NZS 4223 Part 3.",null,null,null,null,null,null,null,null,null,null,null,false,{"$f":"IF(X153=TRUE,TRUE,(AND(SUM(X154:X155)=0,X153=FALSE)))","v":true},"F3 – HAZARDOUS SUBSTANCES AND PROCESSES:"]
[null,124,"Where buildings are used for the storage or use of hazardous substances  has the applicant provided evidence for how this will be verified to comply with F3.3?","Y","storeroom indicated within space\n\n13/07/17 - no hazardous materials storage","Please advise if it is intended to store or use any hazardous substances within this new building element, if so please provide sufficient documentation to demonstrate compliance with the requirements of F3.","Resolved",null,null,null,null,"This application is for building work that is likely to encounter asbestos in a hazardous form..  Provide details if an investigation has been done for this building and/or provide a procedure plan for the handling and/or the removal of any asbestos if it is found during the work.",null,null,null,null,null,null,null,null,null,null,"",{"$f":"IF(D154=\"\",1,(IF(D154=\"RFI\",1,(IF(G154=\"NOT RESOLVED\",1,\"\")))))","v":""},{"$f":"IF(X153=TRUE,\"NO NEED 1\",IF(Y153=TRUE, \"NO NEED 2\",\"NEED\"))","v":"NO NEED 2"},{"$f":"IF(Y155=TRUE,\"REVIEW INCOMPLETE\",\"\")","v":""},{"$f":"IF(Z154<>\"\",1,\"\")","v":""}]
[null,125,"Liquid fuel burners, consider bunding and location of storage tanks. Installation to AS1691.","N/A",null,null,null,null,null,null,null,null,null,null,null,null,null,null,null,null,null,null,"",{"$f":"IF(D155=\"\",1,(IF(D155=\"RFI\",1,(IF(G155=\"NOT RESOLVED\",1,\"\")))))","v":""},{"$f":"IF(Y154=\"NEED\", TRUE, FALSE)","v":false}]
[null,{"$f":"Z156&\" \"&Z157","v":"F4 – SAFETY FROM FALLING: "},null,null,null,null,null,null,null,null,null,"The application includes provision for the storage of more than 100kg of LPG or 1500 litres of diesel. Provide preliminary verification from a HSNO certifier in the form of a report that the proposed work demonstrates compliance with building code performances F3.3 and F8.3.2",null,null,null,null,null,null,null,null,null,null,null,false,{"$f":"IF(X156=TRUE,TRUE,(AND(SUM(X157:X159)=0,X156=FALSE)))","v":true},"F4 – SAFETY FROM FALLING:"]
[null,126,"Has a barrier been provided where people could fall 1 metre or more from a floor of a building, from an opening in the external envelope or from a sudden change of level within or associated with a building including roofs with permanent access?   ","N/A",null,null,null,null,null,null,null,"Locate the position of the liquid fuel tanks on the drawings and detail the size and construction of the bunding to the installation in accordance with AS1691.",null,null,null,null,null,null,null,null,null,null,"",{"$f":"IF(D157=\"\",1,(IF(D157=\"RFI\",1,(IF(G157=\"NOT RESOLVED\",1,\"\")))))","v":""},{"$f":"IF(X156=TRUE,\"NO NEED 1\",IF(Y156=TRUE, \"NO NEED 2\",\"NEED\"))","v":"NO NEED 2"},{"$f":"IF(Y158=TRUE,\"REVIEW INCOMPLETE\",\"\")","v":""},{"$f":"IF(Z157<>\"\",1,\"\")","v":""}]
[null,127,"Do the barriers meet all the requirements of F4.3.4?","N/A",null,null,null,null,null,null,null,null,null,null,null,null,null,null,null,null,null,null,"",{"$f":"IF(D158=\"\",1,(IF(D158=\"RFI\",1,(IF(G158=\"NOT RESOLVED\",1,\"\")))))","v":""},{"$f":"IF(Y157=\"NEED\", TRUE, FALSE)","v":false}]
[null,128,"Where applicable have swimming pool fences been reviewed on B-152(a)(b)?","N/A",null,null,null,null,null,null,null,"Demonstrate compliance with F4 for where people could fall 1 metre or more from an opening, floor or from a sudden change of level within or associated with a building , or roofs with permanent access by providing a barrier.  F4/AS1 provides a means of compliance",null,null,null,null,null,null,null,null,null,null,"",{"$f":"IF(D159=\"\",1,(IF(D159=\"RFI\",1,(IF(G159=\"NOT RESOLVED\",1,\"\")))))","v":""}]
[null,{"$f":"Z160&\" \"&Z161","v":"F5 – CONSTRUCTION & DEMOLITION HAZARDS: "},null,null,null,null,null,null,null,null,null,"Demonstrate compliance with F4 for the barrier.  The barrier must meet all the requirements of performance F4.3.4. F4/AS1 provides a means of compliance.",null,null,null,null,null,null,null,null,null,null,null,false,{"$f":"IF(X161=1,FALSE,TRUE)","v":true},"F5 – CONSTRUCTION & DEMOLITION HAZARDS:"]
[null,129,"Have details been provided of barriers for the protecting the public and for restricting access by children to the site that are relevant to the potential work-site hazards?","Y","no barriers indicated - other businesses in vicinity\n\n13/07/17 - response references Specs 1.2.12?\n\n31/07/17 - A24 extent provided","Council records indicate the presence of other properties (businesses) within this complex which are likely to continue operating during the construction of the addition. Please provide details of barriers that will be provided to protect the public and restrict access sufficient to demonstrate compliance with the requirements of F5.\n\n13/07/17 - thank you for the response, however there is insufficient information to demonstrate protection of the public during works. Please show on drawings the presence of barrier fencing sufficient to prevent public access to site during construction.","Resolved",null,null,null,null,"Demonstrate compliance with F4 in relation to the swimming pool fence ",null,null,null,null,null,null,null,null,null,null,"",{"$f":"IF(D161=\"\",1,(IF(D161=\"RFI\",1,(IF(G161=\"NOT RESOLVED\",1,\"\")))))","v":""},{"$f":"IF(X160=TRUE,TRUE,Y160)","v":true},{"$f":"IF(Y161=FALSE,\"REVIEW INCOMPLETE\",\"\")","v":""},{"$f":"IF(Z161<>\"\",1,\"\")","v":""}]
[null,{"$f":"Z162&\" \"&Z163","v":"F6 – EMERGENCY LIGHTING: "},null,null,null,null,null,null,null,null,null,null,null,null,null,null,null,null,null,null,null,null,null,false,{"$f":"IF(X163=1,FALSE,TRUE)","v":true},"F6 – EMERGENCY LIGHTING:"]
[null,130,"Has this covered by fire safety specialist review on form B-151?","Y",null,null,null,null,null,null,null,"Demonstrate compliance with F5 by providing details of barriers for protecting the public and for restricting access by children to the site that are relevant to the potential work-site hazards.  F5/AS1 provides a means of compliance",null,null,null,null,null,null,null,null,null,null,"",{"$f":"IF(D163=\"\",1,(IF(D163=\"RFI\",1,(IF(G163=\"NOT RESOLVED\",1,\"\")))))","v":""},{"$f":"IF(X162=TRUE,TRUE,Y162)","v":true},{"$f":"IF(Y163=FALSE,\"REVIEW INCOMPLETE\",\"\")","v":""},{"$f":"IF(Z163<>\"\",1,\"\")","v":""}]
[null,{"$f":"Z164&\" \"&Z165","v":"F7 – WARNING SYSTEMS: "},null,null,null,null,null,null,null,null,null,null,null,null,null,null,null,null,null,null,null,null,null,false,{"$f":"IF(X165=1,FALSE,TRUE)","v":true},"F7 – WARNING SYSTEMS:"]
[null,131,"Has this been covered by fire safety specialist review on form B-151?","Y",null,null,null,null,null,null,null,"Demonstrate compliance with F6 in relation to emergency lighting",null,null,null,null,null,null,null,null,null,null,"",{"$f":"IF(D165=\"\",1,(IF(D165=\"RFI\",1,(IF(G165=\"NOT RESOLVED\",1,\"\")))))","v":""},{"$f":"IF(X164=TRUE,TRUE,Y164)","v":true},{"$f":"IF(Y165=FALSE,\"REVIEW INCOMPLETE\",\"\")","v":""},{"$f":"IF(Z165<>\"\",1,\"\")","v":""}]
[null,{"$f":"Z166&\" \"&Z167","v":"F8 – SIGNS: "},null,null,null,null,null,null,null,null,null,"Demonstrate compliance with F7  for the smoke alarms. Provide details of the type of smoke alarm and their location.  Section 3, F7/AS1 provides a means of compliance..",null,null,null,null,null,null,null,null,null,null,null,false,{"$f":"IF(X166=TRUE,TRUE,(AND(SUM(X167:X169)=0,X166=FALSE)))","v":true},"F8 – SIGNS:"]
[null,132,"Has this been covered by fire safety specialist review on form B-151?","Y",null,null,null,null,null,null,null,"Demonstrate compliance with F7 in relation to warning systems for fire. […]",null,null,null,null,null,null,null,null,null,null,"",{"$f":"IF(D167=\"\",1,(IF(D167=\"RFI\",1,(IF(G167=\"NOT RESOLVED\",1,\"\")))))","v":""},{"$f":"IF(X166=TRUE,\"NO NEED 1\",IF(Y166=TRUE, \"NO NEED 2\",\"NEED\"))","v":"NO NEED 2"},{"$f":"IF(Y168=TRUE,\"REVIEW INCOMPLETE\",\"\")","v":""},{"$f":"IF(Z167<>\"\",1,\"\")","v":""}]
[null,133,"Where buildings are used for the storage or use of hazardous substances  have adequate details been provided for how signs identifying potential hazards will comply with F8.3.2?","N/A","pending response to Q124\n\n13/07/17 - advised no hazardous storage",null,null,null,null,null,null,null,null,null,null,null,null,null,null,null,null,null,"",{"$f":"IF(D168=\"\",1,(IF(D168=\"RFI\",1,(IF(G168=\"NOT RESOLVED\",1,\"\")))))","v":""},{"$f":"IF(Y167=\"NEED\", TRUE, FALSE)","v":false}]
[null,134,"Are signs provided in sufficient locations to identify accessible routes and facilities provided for people with disabilities? ","Y","refer A6 and A10",null,null,null,null,null,null,null,null,null,null,null,null,null,null,null,null,null,"",{"$f":"IF(D169=\"\",1,(IF(D169=\"RFI\",1,(IF(G169=\"NOT RESOLVED\",1,\"\")))))","v":""}]
[null,{"$f":"Z170&\" \"&Z171","v":"G1 – PERSONAL HYGIENE: "},null,null,null,null,null,null,null,null,null,"Demonstrate compliance with F8 for signage for hazardous substances storage",null,null,null,null,null,null,null,null,null,null,null,false,{"$f":"IF(X170=TRUE,TRUE,(AND(SUM(X171:X174)=0,X170=FALSE)))","v":true},"G1 – PERSONAL HYGIENE:"]
[null,135,"Are there a sufficient number of sanitary fixtures been provided in convenient locations and appropriate for the people who are intended to use them?","Y",null,null,null,null,null,null,null,"Demonstrate compliance with F8 for providing signs in sufficient locations to identify accessible routes and facilities for people with disabilities. Section 6, F8/AS1, and Section 4.8, NZS4121 provide a means of compliance",null,null,null,null,null,null,null,null,null,null,"",{"$f":"IF(D171=\"\",1,(IF(D171=\"RFI\",1,(IF(G171=\"NOT RESOLVED\",1,\"\")))))","v":""},{"$f":"IF(X170=TRUE,\"NO NEED 1\",IF(Y170=TRUE, \"NO NEED 2\",\"NEED\"))","v":"NO NEED 2"},{"$f":"IF(Y172=TRUE,\"REVIEW INCOMPLETE\",\"\")","v":""},{"$f":"IF(Z171<>\"\",1,\"\")","v":""}]
[null,136,"Does the layout show adequate privacy and space dimensions?","Y","1995 depth, door 760 - sufficient",null,null,null,null,null,null,"Demonstrate compliance with F8 in relation to providing signs warning of [Safety signs, Exit signs, Fire related safety features, Access and facilities for people with disabilities Hazards, Sanitary facilities ]. F8/AS1 provides a means of compliance",null,null,null,null,null,null,null,null,null,null,"",{"$f":"IF(D172=\"\",1,(IF(D172=\"RFI\",1,(IF(G172=\"NOT RESOLVED\",1,\"\")))))","v":""},{"$f":"IF(Y171=\"NEED\", TRUE, FALSE)","v":false}]
[null,137,"Does the location of spaces containing soil fixtures show adequate separation from other spaces and have adequate provision of wash hand basins? ","Y","vanity indicated within space",null,null,null,null,null,null,"Demonstrate compliance with G1 for sanitary fixtures.  Provide a layout  showing sufficient number of sanitary fixtures, that are provided in convenient locations and appropriate for the people who intend to use them.   Section 3 and Tables 1 -4, G1/AS1 provide means of compliance",null,null,null,null,null,null,null,null,null,null,"",{"$f":"IF(D173=\"\",1,(IF(D173=\"RFI\",1,(IF(G173=\"NOT RESOLVED\",1,\"\")))))","v":""}]
[null,138,"Where required have personal hygiene facilities for people with disabilities been made accessible?","Y","sheet A10 - consistent with AS1",null,null,null,null,null,null,"Demonstrate compliance with G1 for providing appropriate privacy. Provides a layout for the hygiene facilities showing appropriate privacy and space dimensions. Section 1.1.8, 3.1 and 6.0, G1AS1 provide means of compliance. ",null,null,null,null,null,null,null,null,null,null,"",{"$f":"IF(D174=\"\",1,(IF(D174=\"RFI\",1,(IF(G174=\"NOT RESOLVED\",1,\"\")))))","v":""}]
[null,{"$f":"Z175&\" \"&Z176","v":"G2 – LAUNDERING: "},null,null,null,null,null,null,null,null,null,"Demonstrate compliance with G1 for soil fixtures.  Provide a  layout for the hygiene facilities showing adequate separation of soil fixture from work areas and/or food preparation and storage areas and having adequate provision of wash hand basins. Section 3, G1/AS1 provides a means of compliance",null,null,null,null,null,null,null,null,null,null,null,true,{"$f":"IF(X176=1,FALSE,TRUE)","v":false},"G2 – LAUNDERING:"]
[null,139,"Have complying laundry facilities and service connections been provided?",null,null,null,null,null,null,null,null,"Demonstrate compliance with G1 for personal hygiene facilities for people with disabilities.  Provide details of personal hygiene facilities for people with disabilities that are accessible.. Section 4, G1/AS1, section 10, NZS4121 and section 8, G12/AS1  provide means of compliance",null,null,null,null,null,null,null,null,null,null,"",{"$f":"IF(D176=\"\",1,(IF(D176=\"RFI\",1,(IF(G176=\"NOT RESOLVED\",1,\"\")))))","v":1},{"$f":"IF(X175=TRUE,TRUE,Y175)","v":true},{"$f":"IF(Y176=FALSE,\"REVIEW INCOMPLETE\",\"\")","v":""},{"$f":"IF(Z176<>\"\",1,\"\")","v":""}]
[null,{"$f":"Z177&\" \"&Z178","v":"G3 – FOOD PREPARATION & PREVENTION OF CONTAMINATION: "},null,null,null,null,null,null,null,null,null,null,null,null,null,null,null,null,null,null,null,null,null,true,{"$f":"IF(X177=TRUE,TRUE,(AND(SUM(X178:X182)=0,X177=FALSE)))","v":true},"G3 – FOOD PREPARATION & PREVENTION OF CONTAMINATION:"]
[null,140,"Where buildings are used for commercial food preparation or require other types of health licensing has advice input from the Health Licensing Team been provided?","N/A",null,null,null,null,null,null,null,"Demonstrate compliance with G2.  Provide details of laundry facilities in a space of adequate size.  G2/AS1 provides a means of compliance.",null,null,null,null,null,null,null,null,null,null,"",{"$f":"IF(D178=\"\",1,(IF(D178=\"RFI\",1,(IF(G178=\"NOT RESOLVED\",1,\"\")))))","v":""},{"$f":"IF(X177=TRUE,\"NO NEED 1\",IF(Y177=TRUE, \"NO NEED 2\",\"NEED\"))","v":"NO NEED 1"},{"$f":"IF(Y179=TRUE,\"REVIEW INCOMPLETE\",\"\")","v":""},{"$f":"IF(Z178<>\"\",1,\"\")","v":""}]
[null,141,"Does the layout show provision of a sink with waste, hot and cold water supply, pantry or fridge, cooking appliance, hygienic food preparation area and do wall linings adjacent to appliances and facilities have surfaces that can be easily maintained in hygienic condition?",null,null,null,null,null,null,null,null,null,null,null,null,null,null,null,null,null,null,null,"",{"$f":"IF(D179=\"\",1,(IF(D179=\"RFI\",1,(IF(G179=\"NOT RESOLVED\",1,\"\")))))","v":1},{"$f":"IF(Y178=\"NEED\", TRUE, FALSE)","v":false}]
[null,142,"Do interior linings in food processing areas have linings and surfaces that are impervious and easily cleaned and constructed from building elements that non-hazardous and are located and shaped to avoid the accumulation of dirt?",null,null,null,null,null,null,null,null,"The Health Licensing Team has the following advice regarding the proposed building work.",null,null,null,null,null,null,null,null,null,null,"",{"$f":"IF(D180=\"\",1,(IF(D180=\"RFI\",1,(IF(G180=\"NOT RESOLVED\",1,\"\")))))","v":1}]
[null,143,"Do spaces in buildings have protection from the likelihood of contamination or vermin entering areas used for the storage, processing or preparation of food and have a means of preventing contamination spreading to other spaces?",null,null,null,null,null,null,null,null,"The layout for the kitchen does not show adequate provision cooking, washing  and storage facilities. Revise design to Demonstrate compliance with G3 for food preparation facilities.  Provide details of the kitchen showing space for a refrigerator, provision of a sink with waste, hot and cold water supply, cooking appliance, hygienic food preparation area and wall linings adjacent to appliances and facilities that have surfaces that can be easily maintained in hygienic condition.  Section 1, G3/AS1 provides a means of compliance",null,null,null,null,null,null,null,null,null,null,"",{"$f":"IF(D181=\"\",1,(IF(D181=\"RFI\",1,(IF(G181=\"NOT RESOLVED\",1,\"\")))))","v":1}]
[null,144,"Where required have food preparation facilities for people with disabilities been made accessible.",null,null,null,null,null,null,null,null,"Demonstrate compliance with G3 for food processing areas. Provide details of interior linings in food processing areas. Show that linings and surfaces are impervious and easily cleaned and constructed from building elements that are non-hazardous and are located and shaped to avoid the accumulation of dirt. Section 2, G3/AS1 provides a means of compliance.",null,null,null,null,null,null,null,null,null,null,"",{"$f":"IF(D182=\"\",1,(IF(D182=\"RFI\",1,(IF(G182=\"NOT RESOLVED\",1,\"\")))))","v":1}]
[null,{"$f":"Z183&\" \"&Z184","v":"G4 – VENTILATION: "},null,null,null,null,null,null,null,null,null,"Demonstrate compliance with G3 for the protection of spaces in buildings from the likelihood of contamination or vermin entering areas used for the storage, processing or preparation of food. Show the means of preventing contamination spreading to other spaces. Section 2, G3/AS1. ",null,null,null,null,null,null,null,null,null,null,null,false,{"$f":"IF(X183=TRUE,TRUE,(AND(SUM(X184:X188)=0,X183=FALSE)))","v":true},"G4 – VENTILATION:"]
[null,145,"Where applicable have HVAC systems been covered by specialist review on form B-160?","Y","refer B160 - Nick Waddington",null,null,null,null,null,null,"Demonstrate compliance with G3 for providing food preparation facilities for people with disabilities. Provide details of food preparation facilities for people with disabilities that are accessible. Section 1.5, G3/AS1 and Section 14, NZS 4121. provide means of compliance.",null,null,null,null,null,null,null,null,null,null,"",{"$f":"IF(D184=\"\",1,(IF(D184=\"RFI\",1,(IF(G184=\"NOT RESOLVED\",1,\"\")))))","v":""},{"$f":"IF(X183=TRUE,\"NO NEED 1\",IF(Y183=TRUE, \"NO NEED 2\",\"NEED\"))","v":"NO NEED 2"},{"$f":"IF(Y185=TRUE,\"REVIEW INCOMPLETE\",\"\")","v":""},{"$f":"IF(Z184<>\"\",1,\"\")","v":""}]
[null,146,"Do spaces within buildings have means of ventilation with outdoor air that will provide an adequate number of air changes to maintain air purity?","N/A","refer B160  ",null,null,null,null,null,null,null,null,null,null,null,null,null,null,null,null,null,"",{"$f":"IF(D185=\"\",1,(IF(D185=\"RFI\",1,(IF(G185=\"NOT RESOLVED\",1,\"\")))))","v":""},{"$f":"IF(Y184=\"NEED\", TRUE, FALSE)","v":false}]
[null,147,"Do buildings have a means of collecting or otherwise removing moisture and other contaminants from the spaces in which they are generated?","N/A","refer B160  ",null,null,null,null,null,null,"Compliance with G4 - Ventilation will be assessed by a specialist reviewer and may generate further questions.",null,null,null,null,null,null,null,null,null,null,"",{"$f":"IF(D186=\"\",1,(IF(D186=\"RFI\",1,(IF(G186=\"NOT RESOLVED\",1,\"\")))))","v":""}]
[null,148,"Is contaminated air disposed of in a way in which avoids creating a nuisance or hazard to people and other property?","N/A","refer B160  ",null,null,null,null,null,null,"Demonstrate compliance with G4.3.1 for providing an adequate number of air changes from outdoor air to maintain air purity. Section 1, G4/AS1 provides a means of compliance.",null,null,null,null,null,null,null,null,null,null,"",{"$f":"IF(D187=\"\",1,(IF(D187=\"RFI\",1,(IF(G187=\"NOT RESOLVED\",1,\"\")))))","v":""}]
[null,149,"Has consideration been given to providing extra ventilation for gas-fuelled appliances?","N/A",null,null,null,null,null,null,null,"Demonstrate compliance with G4.3.3 for removing moisture and other contaminants from the spaces in which they are generated.  ",null,null,null,null,null,null,null,null,null,null,"",{"$f":"IF(D188=\"\",1,(IF(D188=\"RFI\",1,(IF(G188=\"NOT RESOLVED\",1,\"\")))))","v":""}]
[null,{"$f":"Z189&\" \"&Z190","v":"G5 – INTERIOR ENVIRONMENT: "},null,null,null,null,null,null,null,null,null,"Demonstrate compliance with G4.3.4 in relation to disposing of contaminated air in  a way that avoids creating a nuisance or hazard to people and other property.",null,null,null,null,null,null,null,null,null,null,null,true,{"$f":"IF(X189=TRUE,TRUE,(AND(SUM(X190:X192)=0,X189=FALSE)))","v":true},"G5 – INTERIOR ENVIRONMENT:"]
[null,150,"Do habitable spaces, bathrooms and recreation rooms have provision for maintaining an adequate, controlled interior temperature with heating equipment safely fixed and have sufficient space for activity, furniture, and sanitary and mobility aids?",null,null,null,null,null,null,null,null,"Demonstrate compliance with G4.3.5 for providing extra ventilation for gas fuelled appliances.  Sections 2 and 3, G4/AS1",null,null,null,null,null,null,null,null,null,null,"",{"$f":"IF(D190=\"\",1,(IF(D190=\"RFI\",1,(IF(G190=\"NOT RESOLVED\",1,\"\")))))","v":1},{"$f":"IF(X189=TRUE,\"NO NEED 1\",IF(Y189=TRUE, \"NO NEED 2\",\"NEED\"))","v":"NO NEED 1"},{"$f":"IF(Y191=TRUE,\"REVIEW INCOMPLETE\",\"\")","v":""},{"$f":"IF(Z190<>\"\",1,\"\")","v":""}]
[null,151,"Where reception counters or desks are provided for public use, is at least one counter or desk accessible?",null,null,null,null,null,null,null,null,null,null,null,null,null,null,null,null,null,null,null,"",{"$f":"IF(D191=\"\",1,(IF(D191=\"RFI\",1,(IF(G191=\"NOT RESOLVED\",1,\"\")))))","v":1},{"$f":"IF(Y190=\"NEED\", TRUE, FALSE)","v":false}]
[null,152,"Where required, are buildings provided with listening systems which enable enhanced hearing by people with hearing aids?",null,null,null,null,null,null,null,null,"Demonstrate compliance with G5 for habitable spaces, bathrooms and recreation rooms.  Provide details showing provision for maintaining an adequate, controlled interior temperature with heating equipment safely fixed and have sufficient space for activity, furniture, and sanitary and mobility aids   G5/AS1 provides a means of compliance",null,null,null,null,null,null,null,null,null,null,"",{"$f":"IF(D192=\"\",1,(IF(D192=\"RFI\",1,(IF(G192=\"NOT RESOLVED\",1,\"\")))))","v":1}]
[null,{"$f":"Z193&\" \"&Z194","v":"G6 – AIRBORNE & IMPACT SOUND: "},null,null,null,null,null,null,null,null,null,"Demonstrate compliance with G5.3.4 for reception counters or desks provided for public use. Provide details of at least one counter or desk that is accessible.  Section 11,NZS 4121 provides a means of compliance",null,null,null,null,null,null,null,null,null,null,null,true,{"$f":"IF(X193=TRUE,TRUE,(AND(SUM(X194:X195)=0,X193=FALSE)))","v":true},"G6 – AIRBORNE & IMPACT SOUND:"]
[null,153,"Is the STC rating of common walls, floors and ceilings of habitable spaces in household units between occupancies no less than 55?",null,null,null,null,null,null,null,null,"Demonstrate compliance with G5.3.5 for listening systems.  Provide details of listening systems which enable enhanced hearing by people with hearing aids. Section12, NZS 4121.",null,null,null,null,null,null,null,null,null,null,"",{"$f":"IF(D194=\"\",1,(IF(D194=\"RFI\",1,(IF(G194=\"NOT RESOLVED\",1,\"\")))))","v":1},{"$f":"IF(X193=TRUE,\"NO NEED 1\",IF(Y193=TRUE, \"NO NEED 2\",\"NEED\"))","v":"NO NEED 1"},{"$f":"IF(Y195=TRUE,\"REVIEW INCOMPLETE\",\"\")","v":""},{"$f":"IF(Z194<>\"\",1,\"\")","v":""}]
[null,154,"Is the IIC rating of the floors to a separate occupancy above the habitable space of a household unit no less than 55?",null,null,null,null,null,null,null,null,null,null,null,null,null,null,null,null,null,null,null,"",{"$f":"IF(D195=\"\",1,(IF(D195=\"RFI\",1,(IF(G195=\"NOT RESOLVED\",1,\"\")))))","v":1},{"$f":"IF(Y194=\"NEED\", TRUE, FALSE)","v":false}]
[null,{"$f":"Z196&\" \"&Z197","v":"G7 – NATURAL LIGHT: "},null,null,null,null,null,null,null,null,null,"Demonstrate compliance with G6.3.1 for the common walls, floors and ceilings of habitable spaces in household units between occupancies.  Provide details showing these building elements will achieve a STC rating of no less than 55 .  G6/AS1 provides a means of compliance.",null,null,null,null,null,null,null,null,null,null,null,true,{"$f":"IF(X196=TRUE,TRUE,(AND(SUM(X197:X198)=0,X196=FALSE)))","v":true},"G7 – NATURAL LIGHT:"]
[null,155,"Are habitable spaces provided with adequate openings for natural light?",null,null,null,null,null,null,null,null,"Demonstrate compliance with G6.3.2 for floors of a separate occupancy above the habitable space of a household unit..  Provide details showing the floor will achieve an IIC rating of no less than 55 .",null,null,null,null,null,null,null,null,null,null,"",{"$f":"IF(D197=\"\",1,(IF(D197=\"RFI\",1,(IF(G197=\"NOT RESOLVED\",1,\"\")))))","v":1},{"$f":"IF(X196=TRUE,\"NO NEED 1\",IF(Y196=TRUE, \"NO NEED 2\",\"NEED\"))","v":"NO NEED 1"},{"$f":"IF(Y198=TRUE,\"REVIEW INCOMPLETE\",\"\")","v":""},{"$f":"IF(Z197<>\"\",1,\"\")","v":""}]
[null,156,"Are habitable spaces provided with adequate openings for visual awareness of the outside environment?",null,null,null,null,null,null,null,null,null,null,null,null,null,null,null,null,null,null,null,"",{"$f":"IF(D198=\"\",1,(IF(D198=\"RFI\",1,(IF(G198=\"NOT RESOLVED\",1,\"\")))))","v":1},{"$f":"IF(Y197=\"NEED\", TRUE, FALSE)","v":false}]
[null,{"$f":"Z199&\" \"&Z200","v":"G8 – ARTIFICIAL LIGHT: "},null,null,null,null,null,null,null,null,null,"Demonstrate compliance with G7.3.1 for natural light in habitable spaces. Provide details of adequate openings for natural light. Section 1, G7/AS1 provides a means of compliance",null,null,null,null,null,null,null,null,null,null,null,false,{"$f":"IF(X200=1,FALSE,TRUE)","v":true},"G8 – ARTIFICIAL LIGHT:"]
[null,157,"Are spaces used by people, provided with adequate artificial light to enable safe movement in the absence of natural light?","Y","sheet A10 - consistent with AS1",null,null,null,null,null,null,"Demonstrate compliance with G7.3.2 for awareness of the outside environment in habitable spaces.  Provide details of adequate openings for visual awareness of the outside environment ",null,null,null,null,null,null,null,null,null,null,"",{"$f":"IF(D200=\"\",1,(IF(D200=\"RFI\",1,(IF(G200=\"NOT RESOLVED\",1,\"\")))))","v":""},{"$f":"IF(X199=TRUE,TRUE,Y199)","v":true},{"$f":"IF(Y200=FALSE,\"REVIEW INCOMPLETE\",\"\")","v":""},{"$f":"IF(Z200<>\"\",1,\"\")","v":""}]
[null,{"$f":"Z201&\" \"&Z202","v":"G9 – ELECTRICITY: "},null,null,null,null,null,null,null,null,null,null,null,null,null,null,null,null,null,null,null,null,null,false,{"$f":"IF(X201=TRUE,TRUE,(AND(SUM(X202:X204)=0,X201=FALSE)))","v":true},"G9 – ELECTRICITY:"]
[null,158,"Where the building work includes the design and build of electrical installations has this been covered by a review on the B-160 tab?","N/A",null,null,null,null,null,null,null,"Demonstrate compliance with G8 for adequate lighting to enable safe movement in the absence of sufficient natural light. G8/AS1",null,null,null,null,null,null,null,null,null,null,"",{"$f":"IF(D202=\"\",1,(IF(D202=\"RFI\",1,(IF(G202=\"NOT RESOLVED\",1,\"\")))))","v":""},{"$f":"IF(X201=TRUE,\"NO NEED 1\",IF(Y201=TRUE, \"NO NEED 2\",\"NEED\"))","v":"NO NEED 2"},{"$f":"IF(Y203=TRUE,\"REVIEW INCOMPLETE\",\"\")","v":""},{"$f":"IF(Z202<>\"\",1,\"\")","v":""}]
[null,159,"Has sufficient information been provided that the building work will meet the functional requirement ‘where provided in a building, electrical installations shall be safe for their intended use’?","Y","specifications ",null,null,null,null,null,null,null,null,null,null,null,null,null,null,null,null,null,"",{"$f":"IF(D203=\"\",1,(IF(D203=\"RFI\",1,(IF(G203=\"NOT RESOLVED\",1,\"\")))))","v":""},{"$f":"IF(Y202=\"NEED\", TRUE, FALSE)","v":false}]
[null,160,"In buildings intended for use by people with disabilities, are light switches and plug socket outlets been made accessible and usable?","Y","sheet A10 - consistent with AS1",null,null,null,null,null,null,"Compliance with G9 - Electricity will be assessed by a specialist reviewer and may generate further questions.",null,null,null,null,null,null,null,null,null,null,"",{"$f":"IF(D204=\"\",1,(IF(D204=\"RFI\",1,(IF(G204=\"NOT RESOLVED\",1,\"\")))))","v":""}]
[null,{"$f":"Z205&\" \"&Z206","v":"G10 – PIPED SERVICES & G11 - GAS AS AN ENERGY SOURCE:  "},null,null,null,null,null,null,null,null,null,"Demonstrate compliance with G9 in relation to showing that the electrical installations shall be safe for their intended use.",null,null,null,null,null,null,null,null,null,null,null,false,{"$f":"IF(X205=TRUE,TRUE,(AND(SUM(X206:X207)=0,X205=FALSE)))","v":true},"G10 – PIPED SERVICES & G11 - GAS AS AN ENERGY SOURCE: "]
[null,161,"Is there gas appliances being installed and does documentation nominate compliance with G10/AS1, G11/AS1 and NZS 5601.1?","Y","gas hotwater - details provided",null,null,null,null,null,null,"Demonstrate compliance with G9 for light switches and plug sockets outlets in buildings intended for use by people with disabilities. Provide details of light switches and plug sockets outlets that are accessible and usable  Section 2, G9/AS1 and section 14, NZS4121.",null,null,null,null,null,null,null,null,null,null,"",{"$f":"IF(D206=\"\",1,(IF(D206=\"RFI\",1,(IF(G206=\"NOT RESOLVED\",1,\"\")))))","v":""},{"$f":"IF(X205=TRUE,\"NO NEED 1\",IF(Y205=TRUE, \"NO NEED 2\",\"NEED\"))","v":"NO NEED 2"},{"$f":"IF(Y207=TRUE,\"REVIEW INCOMPLETE\",\"\")","v":""},{"$f":"IF(Z206<>\"\",1,\"\")","v":""}]
[null,162,"Does the LPG cylinder location comply with App J, NZS 5601.1?","Y","location indicated suitable\nrestraints indicated\ncondition added for installation in Connect\n\n13/07/17 - standard revised as required","Please revise the standard referenced on sheet A8 in relation to the gas supply. The current standard for gas installation is AS/NZS5601:2013.","Resolved",null,null,null,null,null,null,null,null,null,null,null,null,null,null,null,"",{"$f":"IF(D207=\"\",1,(IF(D207=\"RFI\",1,(IF(G207=\"NOT RESOLVED\",1,\"\")))))","v":""},{"$f":"IF(Y206=\"NEED\", TRUE, FALSE)","v":false}]
[null,{"$f":"Z208&\" \"&Z209","v":"G12 – WATER SUPPLIES: "},null,null,null,null,null,null,null,null,null,"Demonstrate compliance with G10 and G11 for gas appliances and installation. Nominate the means of compliance",null,null,null,null,null,null,null,null,null,null,null,false,{"$f":"IF(X208=TRUE,TRUE,(AND(SUM(X209:X215)=0,X208=FALSE)))","v":true},"G12 – WATER SUPPLIES:"]
[null,163,"Is the water supply from a potable source? ","Y","CCC supply",null,null,null,null,null,null,"Demonstrate compliance with G10 and G11 for the location of the gas storage cylinders. Appendix J, NZS 5601.1 provides a means of compliance.",null,null,null,null,null,null,null,null,null,null,"",{"$f":"IF(D209=\"\",1,(IF(D209=\"RFI\",1,(IF(G209=\"NOT RESOLVED\",1,\"\")))))","v":""},{"$f":"IF(X208=TRUE,\"NO NEED 1\",IF(Y208=TRUE, \"NO NEED 2\",\"NEED\"))","v":"NO NEED 2"},{"$f":"IF(Y210=TRUE,\"REVIEW INCOMPLETE\",\"\")","v":""},{"$f":"IF(Z209<>\"\",1,\"\")","v":""}]
[null,164,"Is the potable water supply isolated from non-potable and are non-potable water supply outlets and pipelines identified?","N/A",null,null,null,null,null,null,null,"This application includes building work for gas storage  that is greater than 100 kg. This will be assessed by a specialist reviewer and may generate further questions.",null,null,null,null,null,null,null,null,null,null,"","",{"$f":"IF(Y209=\"NEED\", TRUE, FALSE)","v":false}]
[null,165,"Is the potable water supply being protected from cross connection or backflow with air gap or backflow prevention device?","Y","no device indicated on BWOF\nSection 112 no worse than existing\n\nmaybe info only\n\n13/07/17 - Wilkins double check valve 950XLT series 20-50mm","Council records show this property to be industrial, however there are no records indicating the presence of backflow prevention device. The Council waters department requires all commercial properties to have a backflow prevention device at the boundary to protect the network water supply. Installation of the backflow preventor requires a building consent. Please advise if you would like to increase to scope to include the installation of a backflow prevention device, if so all supporting documentation identifying type and model will also be required.","Resolved",null,null,null,null,"Demonstrate compliance with G12 for the water supply.  Provide details of the proposed water supply to this building. Refer to the attached information sheet B-313. A construction documentation note will be added to the building consent requiring a certificate for potable water must be provided to the Building Inspections Department before the building is allowed to be occupied and a Code Compliance Certificate issued ",null,null,null,null,null,null,null,null,null,null,{"$f":"IF(D211=\"RFI\",1,\"\")","v":""},""]
[null,166,"Have our Technical Services Team requested that the applicant include in the building work the installation of a backflow prevention device at the point-of-supply?","Y","refer Q165 above",null,null,null,null,null,null,"Demonstrate compliance with G12 for the potable water supply to be isolated from the non-potable. Provide details of the identification of non-potable water supply outlets.  G12/AS1 Sections 3 and 4, G12/AS1 provides a means of compliance.",null,null,null,null,null,null,null,null,null,null,"",""]
[null,167,"Does the hot & cold water supply system comply with section 5 & 6, G12/AS1?","Y","specifications",null,null,null,null,null,null,"Demonstrate compliance with G12 for protecting the potable water supply from cross connection or backflow by means of an air gap or a backflow prevention device.  Section 3, G12/AS1",null,null,null,null,null,null,null,null,null,null,"",""]
[null,168,"Is the storage water heater adequately supported and restrained, and located where it can be accessed for inspection, maintenance and removal?","N/A","Gas supply",null,null,null,null,null,null,"The Council's Technical Services Team have requested that the installation of a backflow prevention device at the point-of-supply is included as part of the building work ",null,null,null,null,null,null,null,null,null,null,"",""]
[null,169,"Where a solar water heater is being installed has it been reviewed on form B-112?","N/A",null,null,null,null,null,null,null,"Demonstrate compliance with G12 for the installation of the hot and cold water supply system. Section 5 and 6, G12/AS1 provides a means of compliance.",null,null,null,null,null,null,null,null,null,null,"",""]
[null,{"$f":"Z216&\" \"&Z217","v":"G13 – FOUL WATER: "},null,null,null,null,null,null,null,null,null,"Demonstrate compliance with G12 for the adequate of support and restraint of the hot water storage heater, its location, and accessibility for inspection and maintenance. Section 6, G12/AS1 provides a means of compliance.",null,null,null,null,null,null,null,null,null,null,null,false,{"$f":"IF(X216=TRUE,TRUE,(AND(SUM(X217:X223)=0,X216=FALSE)))","v":true},"G13 – FOUL WATER:"]
[null,170,"Has a layout of sanitary plumbing to convey foul water to a drainage system been provided with sufficient details of pipe sizes, gradients and venting to establish compliance with G13.3.1?","Y","pipe sizes to floor consistent with AS3500\n\n13/07/17 - revised to reflect 65mm within slab A4","Please review the plumbing design taking into consideration that AS3500 requires all drains within slabs to be minimum of 65mm diameter.","Resolved",null,null,null,null,"Demonstrate compliance with H1.3.4 for providing hot water.  Provide details of an adequate degree of energy efficiency for the location of the hot water cylinder. NZS 4305 provides a means of compliance.",null,null,null,null,null,null,null,null,null,null,"",{"$f":"IF(D217=\"\",1,(IF(D217=\"RFI\",1,(IF(G217=\"NOT RESOLVED\",1,\"\")))))","v":""},{"$f":"IF(X216=TRUE,\"NO NEED 1\",IF(Y216=TRUE, \"NO NEED 2\",\"NEED\"))","v":"NO NEED 2"},{"$f":"IF(Y218=TRUE,\"REVIEW INCOMPLETE\",\"\")","v":""},{"$f":"IF(Z217<>\"\",1,\"\")","v":""}]
[null,171,"Has a layout of drainage to convey foul water to an appropriate outfall been provided with sufficient details of pipe sizes, gradients, access points, ventilation, invert levels, overflow relief and capacity of existing system to establish compliance with G13.3.2?","Y","two existing IB\nterminal vent within 90mm wall - not structural element\ndrainage pipe details consistent with AS3500\n\n13/07/17 - drainage revised to reflect all existing drainage removed and rerouted outside footprint of building","1. The plumbing plan indicates the presence of two existing inspection bends (IB) for the existing sewer pipe. Please review the requirement and if necessary provide sufficient details to demonstrate that these can be maintained to demonstrate compliance with the requirements of AS3500.\n\n2. Please review the location of inspection points for the existing wastewater connection - note at least one required outside the edge of building.","Resolved",null,null,null,null,"Demonstrate compliance with G12 for the solar water heaters.  G12/AS2 provides a means of compliance.",null,null,null,null,null,null,null,null,null,null,"","",{"$f":"IF(Y217=\"NEED\", TRUE, FALSE)","v":false}]
[null,172,"Has the implications of trenches close to buildings, unstable soils and drains under buildings been considered?","Y","no details provided within drawings or specifications\n\n13/07/17 - A4 additional details","Please provide sufficient information to demonstrate compliance with the requirements of AS3500 in relation to implications of trenches close to building and drains under buildings.","Resolved",null,null,null,null,"Demonstrate compliance with G13 for the layout of sanitary plumbing to convey foul water to a drainage system. Provide sufficient details of pipe sizes, gradients and venting to establish compliance with G13.3.1. Also consider routing of pipework through the structure of the building to comply with B1.  Sections 3–5, G13/AS1 and sections 6-8, AS/NZS3500.2 provide means of compliance",null,null,null,null,null,null,null,null,null,null,"",""]
[null,173,"Where a pumped discharge is proposed have sufficient details been provided to establish compliance with G13.3.4","N/A",null,null,null,null,null,null,null,"Demonstrate compliance with G13 for the layout of drainage to convey foul water to an appropriate outfall.  Provide sufficient details of pipe sizes, gradients, access points, ventilation, invert levels, overflow relief and the capacity of existing system to establish compliance with G13.3.2.  Sections 3–5, G13/AS2 and sections 4 & 5, AS/NZS3500.2 provide means of compliance",null,null,null,null,null,null,null,null,null,null,"",""]
[null,174,"Where an on-site disposal system is being installed has it been adequately designed to comply with the performance clause G13.3.4? ","N/A",null,null,null,null,null,null,null,"Demonstrate compliance with B1 and G13 for trenches close to buildings and drains under buildings. Section 5, G13/AS2 provide means of compliance. ",null,null,null,null,null,null,null,null,null,null,"",""]
[null,175,"Where a grease trap is being installed has it been reviewed by the Technical Services Team for TA issues and also reviewed by the BCO for compliance with G13 and G14?","N/A",null,null,null,null,null,null,null,"Demonstrate compliance with G13 for the pumped discharge system. Provide sufficient details to establish compliance with G13.3.2 and G13.3.3.",null,null,null,null,null,null,null,null,null,null,"",""]
[null,176,"Where a pre-treatment facility is being installed has it been reviewed by the Technical Services Team for TA issues and also reviewed by the BCO for compliance with G13 and G14?","N/A",null,null,null,null,null,null,null,"Demonstrate compliance with G13 in relation to the on-site disposal  system. Provide sufficient details to establish compliance with G13.3.4",null,null,null,null,null,null,null,null,null,null,"",""]
[null,{"$f":"Z224&\" \"&Z225","v":"G14 – INDUSTRIAL LIQUID WASTE: "},null,null,null,null,null,null,null,null,null,"Demonstrate compliance with G13 in relation to the grease trap. Provide sufficient details to establish compliance with G13.3.2 and G13.3.3.",null,null,null,null,null,null,null,null,null,null,null,false,{"$f":"IF(X225=1,FALSE,TRUE)","v":true},"G14 – INDUSTRIAL LIQUID WASTE:"]
[null,177,"Where applicable has this been covered by specialist plumbing and drainage review?","N/A",null,null,null,null,null,null,null,"Demonstrate compliance with G13 in relation to the pre-treatment facility. Provide sufficient details to establish compliance with G13.3.2 and G13.3.3.",null,null,null,null,null,null,null,null,null,null,"",{"$f":"IF(D225=\"\",1,(IF(D225=\"RFI\",1,(IF(G225=\"NOT RESOLVED\",1,\"\")))))","v":""},{"$f":"IF(X224=TRUE,TRUE,Y224)","v":true},{"$f":"IF(Y225=FALSE,\"REVIEW INCOMPLETE\",\"\")","v":""},{"$f":"IF(Z225<>\"\",1,\"\")","v":""}]
[null,{"$f":"Z226&\" \"&Z227","v":"G15 – SOLID WASTE: "},null,null,null,null,null,null,null,null,null,null,null,null,null,null,null,null,null,null,null,null,null,false,{"$f":"IF(X227=1,FALSE,TRUE)","v":true},"G15 – SOLID WASTE:"]
[null,178,"Where solid waste storage and/or rubbish chutes have been provided and/or required, has the design been assessed with G15/AS1?","N/A",null,null,null,null,null,null,null,"The specialist plumbing and drainage reviewer of this application requires ",null,null,null,null,null,null,null,null,null,null,"",{"$f":"IF(D227=\"\",1,(IF(D227=\"RFI\",1,(IF(G227=\"NOT RESOLVED\",1,\"\")))))","v":""},{"$f":"IF(X226=TRUE,TRUE,Y226)","v":true},{"$f":"IF(Y227=FALSE,\"REVIEW INCOMPLETE\",\"\")","v":""},{"$f":"IF(Z227<>\"\",1,\"\")","v":""}]
[null,{"$f":"Z228&\" \"&Z229","v":"H1 – ENERGY EFFICIENCY: "},null,null,null,null,null,null,null,null,null,null,null,null,null,null,null,null,null,null,null,null,null,false,{"$f":"IF(X228=TRUE,TRUE,(AND(SUM(X229:X232)=0,X228=FALSE)))","v":true},"H1 – ENERGY EFFICIENCY:"]
[null,179,"Is the building’s thermal envelope to its conditioned space defined and airflow controlled?","Y","refer Q181",null,null,null,null,null,null,"Demonstrate compliance with G15 for providing solid waste storage and/or rubbish chutes. G15/AS1 provides a means of compliance.",null,null,null,null,null,null,null,null,null,null,"",{"$f":"IF(D229=\"\",1,(IF(D229=\"RFI\",1,(IF(G229=\"NOT RESOLVED\",1,\"\")))))","v":""},{"$f":"IF(X228=TRUE,\"NO NEED 1\",IF(Y228=TRUE, \"NO NEED 2\",\"NEED\"))","v":"NO NEED 2"},{"$f":"IF(Y230=TRUE,\"REVIEW INCOMPLETE\",\"\")","v":""},{"$f":"IF(Z229<>\"\",1,\"\")","v":""}]
[null,180,"Has the method of compliance for adequate thermal resistance of the building’s thermal envelope been nominated and shown to comply?  \nList applicable method of compliance and provide comment if appropriate\nSmall building envelope\n• Schedule method, NZS 4218:2004 as modified by H1/AS1\n• Calculation method,  NZS 4218:2004 as modified by H1/AS1 \n• Modelling method,  NZS 4218:2004 as modified by H1/VM1 \n• BPI verification method, e.g. ALF3.2.   \n• Alternative solution ( e.g. Appendix D, NZS 4218:2009 for additions)\nLarge building envelope\n• Modelling method NZS 4243.1:2007\n• Calculation method NZS 4243.1:2007\n• Schedule method NZS 4243.1:2007","Y","?supervisor - openings in calcs only reflected on two sides, do they need to take into consideration openings on the internal wall where there are no doors.\n\nCalculations method details provided - compliance with 4218 small buildings\ndemonstrate compliance pending response to above\n\n13/07/17\n1. store not to be insulated as per A6\n2. revised calcs provided\n","1. Please provide details of the extent of conditioned space for the new addition taking into consideration the opening between the new and existing building sufficient to demonstrate compliance with the requirements of H1.\n\n2. Please review the H1 calculations provided. The reference heat loss for the vertical glazing appears excessive in relation to the proposed vertical glazing.","Resolved",null,null,null,null,null,null,null,null,null,null,null,null,null,null,null,"",{"$f":"IF(D230=\"\",1,(IF(D230=\"RFI\",1,(IF(G230=\"NOT RESOLVED\",1,\"\")))))","v":""},{"$f":"IF(Y229=\"NEED\", TRUE, FALSE)","v":false}]
[null,181,"Will the construction and insulation specified on the consent drawings achieve the construction R-value stated in the compliance report?  ","Y","construction values indicated in calc method appear consistent with achieveable construction values",null,null,null,null,null,null,"Demonstrate compliance for H1 for the conditioned spaces of the building.  Provide details showing the thermal envelope and control of airflow. ",null,null,null,null,null,null,null,null,null,null,"",{"$f":"IF(D231=\"\",1,(IF(D231=\"RFI\",1,(IF(G231=\"NOT RESOLVED\",1,\"\")))))","v":""}]
[null,182,"Has artificial lighting in commercial and communal non-residential buildings with floor areas > 300m2 been shown to comply with NZS 4243.2:2007?","N/A","<300m²",null,null,null,null,null,null,"Demonstrate compliance for H1 for adequate thermal resistance of the building’s thermal envelope. Provide details of the method for demonstrating compliance including calculations   H1/AS1 provide a means of compliance",null,null,null,null,null,null,null,null,null,null,"",{"$f":"IF(D232=\"\",1,(IF(D232=\"RFI\",1,(IF(G232=\"NOT RESOLVED\",1,\"\")))))","v":""}]
[null,{"$f":"Z233&\" \"&Z234","v":"COMPLIANCE SCHEDULES / SPECIFIED SYSTEMS: "},null,null,null,null,null,null,null,null,null,"Demonstrate how the construction detail […] will achieve the construction R‑value proposed for that building element. ",null,null,null,null,null,null,null,null,null,null,null,null,{"$f":"IF(SUM(X234:X235)=0,TRUE,FALSE)","v":true},"COMPLIANCE SCHEDULES / SPECIFIED SYSTEMS:"]
[null,183,"Is there a compliance schedule to be created for this building or an existing one to be amended?","Y","compliance schedule to be amended\n\n13/07/17 - appears no original compliance schedule\n\n15/08/17 - new schedule created",null,null,null,null,null,null,"Demonstrate compliance for H1.3.5 for artificial lighting. Provide details of an adequate degree of energy efficiency when providing artificial lighting. Section 6, H1/AS1 and NZS 4243.2:2007 provide means of compliance.",null,null,null,null,null,null,null,null,null,null,"",{"$f":"IF(D234=\"\",1,(IF(D234=\"RFI\",1,(IF(G234=\"NOT RESOLVED\",1,\"\")))))","v":""},{"$f":"IF(X233=TRUE,\"NO NEED 1\",IF(Y233=TRUE, \"NO NEED 2\",\"NEED\"))","v":"NO NEED 2"},{"$f":"IF(Y235=TRUE,\"REVIEW INCOMPLETE\",\"\")","v":""},{"$f":"IF(Z234<>\"\",1,\"\")","v":""}]
[null,184,"For the specified systems, is it proposed to use the Performance Standards plus inspection, maintenance and reporting procedures from the Building Code Handbook? ","Y",null,null,null,null,null,null,null,null,null,null,null,null,null,null,null,null,null,null,"",{"$f":"IF(D235=\"\",1,(IF(D235=\"RFI\",1,(IF(G235=\"NOT RESOLVED\",1,\"\")))))","v":""},{"$f":"IF(Y234=\"NEED\", TRUE, FALSE)","v":false}]
[null,{"$f":"Z236&\" \"&Z237","v":"INSPECTIONS / CONSTRUCTION MONITORING: "},null,null,null,null,null,null,null,null,null,null,null,null,null,null,null,null,null,null,null,null,null,null,{"$f":"IF(SUM(X237:X238)=0,TRUE,FALSE)","v":true},"INSPECTIONS / CONSTRUCTION MONITORING:"]
[null,185,"Has the applicant proposed any inspection procedures for during the\nconstruction alteration, demolition or removal of the building? Eg\n· Consider the construction monitoring that has been agreed to be\nundertaken by the design professionals.\n· Estimate the type and number of inspections required to be\nundertaken by CCC Building Control Officials.","Y","pending response to Q12\n\n13/07/17\nStructex Harvard Ltd\n• Excavation (subgrade beneath foundation footprint) – by Geotechnical engineer\n• Foundations before casting\n• Concrete block walls after reinforcing but before grouting\n• Structural steelwork after erection\n• Connections between structural components\n",null,null,null,null,null,null,"Demonstrate compliance for H1.3.5 for artificial lighting. Provide details of an adequate degree of energy efficiency when providing artificial lighting. Section 6, H1/AS1 and NZS 4243.2:2007 provide means of compliance.",null,null,null,null,null,null,null,null,null,null,{"$f":"IF(D237=\"RFI\",1,\"\")","v":""},{"$f":"IF(D237=\"\",1,(IF(D237=\"RFI\",1,(IF(G237=\"NOT RESOLVED\",1,\"\")))))","v":""},{"$f":"IF(X236=TRUE,\"NO NEED 1\",IF(Y236=TRUE, \"NO NEED 2\",\"NEED\"))","v":"NO NEED 2"},{"$f":"IF(Y238=TRUE,\"REVIEW INCOMPLETE\",\"\")","v":""},{"$f":"IF(Z237<>\"\",1,\"\")","v":""}]
[null,186,"If a producer statement for construction monitoring (PS4) is required to be\nprovided at the completion of work, has an agreement been obtained from\nthe applicant to do so?","Y","pending response to Q12",null,null,null,null,null,null,"Provide adequate specifications, relevant to the project covering all trades, materials, proprietary systems and reference documents.",null,null,null,null,null,null,null,null,null,null,{"$f":"IF(D238=\"RFI\",1,\"\")","v":""},{"$f":"IF(D238=\"\",1,(IF(D238=\"RFI\",1,(IF(G238=\"NOT RESOLVED\",1,\"\")))))","v":""},{"$f":"IF(Y237=\"NEED\", TRUE, FALSE)","v":false}]
[null,{"$f":"Z239&\" \"&Z240","v":"OTHER ITEMS: "},null,null,null,null,null,null,null,null,null,null,null,null,null,null,null,null,null,null,null,null,null,null,{"$f":"IF(SUM(X240:X241)=0,TRUE,FALSE)","v":true},"OTHER ITEMS:"]
[null,187,"Has an adequate specification that is relevant to the project been provided covering all trades, materials, proprietary systems and reference documents?","Y","sections in specification consistent with project",null,null,null,null,null,null,null,null,null,null,null,null,null,null,null,null,null,"",{"$f":"IF(D240=\"\",1,(IF(D240=\"RFI\",1,(IF(G240=\"NOT RESOLVED\",1,\"\")))))","v":""},{"$f":"IF(X239=TRUE,\"NO NEED 1\",IF(Y239=TRUE, \"NO NEED 2\",\"NEED\"))","v":"NO NEED 2"},{"$f":"IF(Y241=TRUE,\"REVIEW INCOMPLETE\",\"\")","v":""},{"$f":"IF(Z240<>\"\",1,\"\")","v":""}]
[null,188,"Record any decisions regarding other issues, e.g.\n·      Durability to satisfy functional requirements of the Building Code for all clauses throughout the life of the building.\n·      Existing building to continue to comply with the provisions of the Building Code to at least the same extent as before the alteration.\n·      Coordination of all specialist reviews including any implication of design changes during processing","N/A",null,null,null,null,null,null,null,null,null,null,null,null,null,null,null,null,null,null,"",{"$f":"IF(D241=\"\",1,(IF(D241=\"RFI\",1,(IF(G241=\"NOT RESOLVED\",1,\"\")))))","v":""},{"$f":"IF(Y240=\"NEED\", TRUE, FALSE)","v":false}]
[null,null,null,null,null,null,null,null,null,null,null,null,null,null,null,null,null,null,null,null,null,null,{"$f":"SUM(W15:W241)","v":0}]
[null,"BCO REVIEW COMPLETED",null,null,null,"BCO Name","Status/Date Completed"]
[null,null,"          BCO review completed. \n          Ok to continue processing         ",null,{"$f":"IF(AA244>0,\"NOTE: PROCESSING INCOMPLETE - CANNOT SIGNOFF AT PRESENT\",\"\")","v":""},{"$f":"'Summary sheet'!E51","v":"Tania McGrath"},"2017-08-15",null,{"$f":"SUM(I228:I243)","v":0},null,null,null,null,null,null,null,null,null,null,null,null,null,null,true,null,null,{"$f":"SUM(AA14:AA243)","v":0}]
[null,null,null,null,null,null,null,null,null,null,null,"ON HOLD"]

{"sheet":"B150-Structural specialist ","index":5,"n_rows":97,"n_cols":27,"rows_kept":97,"cut":false,"hidden":false,"merged":[[4,1,4,6],[3,1,3,6],[11,1,11,2],[7,8,7,9],[9,1,9,3],[9,4,9,6],[11,4,17,6],[10,1,10,6],[18,1,18,6],[37,1,37,4],[5,4,5,6],[7,4,7,6],[8,4,8,6],[6,1,6,3],[5,1,5,3],[7,1,7,3],[8,1,8,3],[27,1,27,2],[29,1,29,2],[34,1,34,2],[6,4,6,6],[23,1,23,2]]}
[null,null,null,null,null,null,null,null,"Summary sheet","B501-Not accepted letter"]
[null,"B-150 LU: 20.12.16 LR: 20.12.16, v8",null,null,null,null,null,null,"Vetting sheet","B501a-Not accepted with invoice"]
[null,null,null,null,null,null,null,null,"B120-Processing sheet","Application update letter"]
[false,{"$f":"IF(Y4=TRUE,\"                  SPECIALIST REVIEW ON THIS PROCESSING SHEET IS NOT APPLICABLE TO THIS APPLICATION\",\"\")","v":""},null,null,null,null,null,null,"B150-Structural specialist","B521-RFI letter",null,null,null,null,null,null,null,null,null,null,null,null,null,null,{"$f":"Y5","v":false},{"$f":"'Summary sheet'!C41","v":"N/A"},{"$f":"IF(Z4=\"YES\",1,\"\")","v":""}]
[null,"Form B-150                                    SPECIALIST STRUCTURE PROCESSING SHEET (Producer Statements B1 and B2)",null,null,null,null,null,null,"B151a-Fire safety specialist","B529-Final reminder letter",null,null,null,null,null,null,null,null,null,null,null,null,null,null,{"$f":"IF(SUM(AA4:AA5)>0,FALSE,TRUE)","v":false},{"$f":"'Summary sheet'!C40","v":"Yes"},{"$f":"IF(Z5=\"YES\",1,\"\")","v":1}]
[null,"Building consent number (BCN):   ","Building consent number (BCN):   ","Building consent number (BCN):   ",{"$f":"'Summary sheet'!E15","v":"BCN/2017/2013"},null,null,null,"B151b-Fire safety specialist","B532-Refusal letter"]
[null,"Project address:   ","Project address:   ","Project address:   ",{"$f":"'Summary sheet'!E16","v":"80 Byron Street Sydenham "},null,null,null,"B160-PS specialist","S71-74 natural hazards"]
[null,"Description of building work:","Project description:","Project description:",{"$f":"'Summary sheet'!E17","v":"Addition to Factory - New Offices, Meeting and Store Room"},null,null,null,"B462-Draft CS",null,null,null,null,null,null,null,null,null,null,{"$f":"E8","v":"Addition to Factory - New Offices, Meeting and Store Room"}]
[null,"Building level:        ","Building level:        ","Building level:        ",{"$f":"'Summary sheet'!E18","v":"Commercial 1"}]
[null,"Classified use(s):  ","Classified use(s):  ","Classified use(s):  ",{"$f":"'Summary sheet'!E19","v":"Commercial"},null,null,null,null,null,null,null,"OK"]
[]
[null,"Items reviewed: (items to be added by the first reviewer of the application, either specialist or BCO)",null,"OK (for specialist use only)","Key for abbreviations to answering processing questions\nY - The application satisfies the intent of the question. Provide comment if appropriate\nN/a - The question is not applicable to this application. Provide comment if appropriate\nRFI - The application has not meet the intent of this question and a request for information is required. Write request in RFI cell for inclusion in RFI letter. The application must not be granted until all RFIs are resolved and the answer has been changed to Yes or N/a\nUse Resolved or Not resolved in the far right column to indicate status of RFI item after receiving a response to the RFI item. This will appear on any further RFI letters"]
[null,1,null,null,null,null,null,null,null,null,null,null,"Y"]
[null,2,null,null,null,null,null,null,null,null,null,null,"N/A"]
[null,3,null,null,null,null,null,null,null,null,null,null,"RFI"]
[null,4]
[null,5,null,null,null,null,null,null,null,null,null,"("]
[null,6,null,null,null,null,null,null,null,null,null,")"]
[null,"TO SPECIALIST REVIEWERS If the land has been reviewed by a geotechnical specialist, the geotechnical specialist to provide comments in Item 1 only. If applicable, both specialist reviewers to provide sign-off to processing sheet",null,null,null,null,null,null,null,null,null,"Resolved"]
[null,null,"Items to be checked","(Y, N/a RFI)","Comments","RFI","RFI Resolved",null,null,null,null,"Not Resolved"]
[null,"GEOTECHNICAL SPECIALIST REVIEW (if applicable)"]
[null,1,"Land - Geotechnical report (list reason)\n(e.g. fill, rock fall, subsidence, erosion, etc)","Y","• TCNA (commercial) ;  Liquefaction risk moderate\n• Proposed fdn concrete slab tied to existing bldg concrete slab\n• Engco Geotechnical report for 83 Byron St (40m NE of extension)\n̵ 2 CPTs, 2 HA; ̵ Gravel fill to 0.3m, clayey silt to 2.0m consistency?\n̵ GW not encountered\n̵ Liquefaction induced settlement 60 – 90mm (SLS2, 10m); 90 – 115mm (ULS, 10m); “very little” in upper 4.5m (SLS or ULS)\n̵ Lateral spreading risk low; ̵ Lateral stretch risk minor to moderate\n̵ Conventional shallow fdn not recommended\n̵ Piled fdn considered suitable founded at 12.5m; soil between 12 & 16m has sufficient bearing and thickness for deep piles\n̵ If residential, would be TC3\n• Expected profile (from 50m NW of site): 0.8m fill, silt with occ sand to 4.5m, fine to med sand to ≥ 15m\n• GW 0.0 – 2.0m (GNS); 1.0 – 2.0m (EQC)\n• Vert ground movement 100 – 200mm from CEQ (EQC)\n• Horiz ground movement 170mm to SW (EQC)\n• No liq ejecta observed after CES \n• No ground cracks on site or nearby (EQC)\n• Site sufficiently tested to SLS\n• Damage to existing bldg was light and limited\n• Class D deep or soft soil\n• FFL 14.39m; avg ground level on site 13.82m\n• Site investigation: 2 HA to 3.2m, 2 Scala to 2.9 – 3.9m\n- asphalt to 0.025m; med dense sandy gravel fill to 0.4 - 0.5m; soft to firm organic silt fill to 0.65 - 0.75m; firm to stiff clayey silt to 2.5m; firm sandy silt to at least 3.2m; GW at 1.6m\nHydrocarbon smell at 1.0m in HA102\nUBC = 150kPa in fill; 300kPa in upper 3m of natural silt","a) please provide Engco geotechnical report for 83 Byron St. ADDED 13/7/17 report not provided; please provide ENGCO report. ADDED 31/7/17: Please provide results of CPT and CPTu site investigation. RESOLVED 15/8/17\n\na2) ADDED 31/7/17: The Engco report for 83 Byron St indicates potential liquefaction induced settlement up to 100mm for SLS and up to 165mm for ULS are possible. Please clarify that this has been considered in design of the slab footing for 80 Byron St extension. 15/8/17: WITHDRAWN\n\nb) Please compare foundation for existing building to the foundation for the proposed extension since the two will be structurally connected. WITHDRAWN  13/7/17\n\nc) Specification section 2.4.1 Excavation states: “Below slabs on ground the general intent is to excavate to a stable undisturbed subgrade (of 300kPa ultimate bearing capacity).” This is inconsistent with the PS1 and the geotechnical letter which indicate the foundation was designed for a safe bearing of 50kPa (which I understand to be equivalent to an ultimate bearing capacity of 150kPa which was recommended by the geotechnical letter). Please amend specification. RESOLVED 13/7/2013\n\nd) Specification section 2.4.1 Excavation also states “As soon as excavation and filling is complete foundation material will be inspected by the Architect…”. Please amend specification for foundation subgrade to be verified by the geotechnical engineer. RESOLVED 13/7/2013\n\ne) Specification section 2.4.2 Hardfill & Blinding states “Hardfill under slabs on grade shall be 150mm of standard TNZ AP40 basecourse…”  The geotechnical letter recommends a 300mm thick layer of AP65 below the concrete slab if placed on organic fill with UBC 150kPa, with geotextile (Bidim A19 or equal) on base & sides of excavation, geogrid (Cirtex Duragrid 30/30 or equal) over the textile; extending beyond the building footprint a distance equal to the depth of the gravel. Please address why geotechnical recommendations were not followed. RESOLVED 13/7/2013\n\n","RESOLVED",null,null,null,{"$f":"IF(F22=\"\",\"\",2)","v":2},null,null,null,null,{"$f":"IF(D22=\"RFI\",1,(IF(G22=\"NOT RESOLVED\",1,\"\")))","v":""}]
[null,"1A","Additional geotechnical RFI placeholder","N/A","13/7/17\nb) DFR section 2.1 states office has been designed to be seismically separate from the existing structure\nc - e) specification sections 2.4.1 & 2.4.2 amended as requested\n31/7/17 Engco report provided; SI includes 3 CPTu to 15m but results not included nor is consistency of soil layers in ground model. Total free field liquefaction induced settlement (index value - upper 10m) is 55-80mm (SLS1), 60-90mm (SLS2, 90-115mm (ULS)\n15/8/17\na) report provided\na2) geotechnical recommendations were followed; therefore settlement will have been considered. \nf) on the south side the new slab is tied into the existing slab as recommended. This tie in is intended to provide support to the floor slab in the event of ground slumping at this boundary. \non the western side of the dounation the recommendation in the geotechnical report is for the slab to be able to cantilever in the case of loss of support from settlement of the hardfill. the hardfill is 300mm deep and so a cantilever length of 300mm has been allowed for. the 300mm thick slab thickening with H12 @400 centres is able to cantilever this distance easily. Additional calculatoin provided shows the load on the western edge of the slab comes from the wall only as the roof support is on the N & S and internal walls, and that under the assessed ULS load the slab as detailed in the drawings is able to cantilever a length >400mm.","f) The geotechnical letter also recommends that where it is not possible to extend the gravel layer beyond the building footprint on the South & West sides of the building because the site boundary does not does not provide adequate space, a new slab section must be designed. Please address this issue. ADDED 13/7/17: Response revers to structural calculations; this does not answer the question. Please indicate where this information is found. 31/7/17: no response provided RESOLVED 15/8/17",null,null,null,null,{"$f":"IF(F23=\"\",\"\",2)","v":2},null,null,null,null,{"$f":"IF(D23=\"RFI\",1,(IF(G23=\"NOT RESOLVED\",1,\"\")))","v":""}]
[null,"STRUCTURE – GENERAL INFORMATION:",null,null,null,null,null,null,null,null,{"$f":"SUM(K22:K23)","v":4},"The performance required by this item is not applicable to the building work included in this application",null,null,null,{"$f":"SUM(P22:P23)","v":0}]
[null,2,"Geotechnical report (suitability of foundation design)\n",null,"Geotechnical letter for proposed extension, EDC, 14 March 2017, signed Gareth Williams (CPEng- geotech)\nreferences Geotechnical report by Engco for 83 Byron St, Ref 16363, rev 1, 30/1/2017, signed Andrew Lind, CPEng (civil/struct) (40m NE of extension).\nGeotechnical Report for proposed commercial building, ref 16363, 11/11/2016, Engco, signed Andrew Lind, CPEng (civil, Structural) & David Brierley, CPEng (management)",null,null,null,null,null,{"$f":"IF(F25=\"\",\"\",2)","v":""},"This item is not applicable because the existing building's compliance is unchanged the building work included in this application",null,null,null,{"$f":"IF(D25=\"RFI\",1,(IF(G25=\"NOT RESOLVED\",1,\"\")))","v":""}]
[null,3,"New Large Building - Design features report \n(lateral force and derivation)",null,null,null,null,null,null,null,{"$f":"IF(F26=\"\",\"\",2)","v":""},null,null,null,null,{"$f":"IF(D26=\"RFI\",1,(IF(G26=\"NOT RESOLVED\",1,\"\")))","v":""}]
[null,4,"Existing Building -  Structural report (age, condition, strength):\ns112 BA 2004 Building Upgrade\ns114 BA 2004 Change of Use\ns122 BA 2004 Earthquake Prone \nFoundations\nFire damage\nDemolition\nOther (specify)",null,null,null,null,null,null,null,{"$f":"IF(F27=\"\",\"\",2)","v":""},"Specialist Review : Geotechnical",null,null,null,{"$f":"IF(D27=\"RFI\",1,(IF(G27=\"NOT RESOLVED\",1,\"\")))","v":""}]
[null,"STRUCTURE (SPECIFIC DESIGN):  ",null,null,null,null,null,null,null,null,null,{"$f":"L27&\"  \"&L17&F40&L18","v":"Specialist Review : Geotechnical  (Margaret Stoffel)"}]
[null,5,"Producer statements for design and design review are to;\n• be accompanied by supporting information e.g. calculations and test reports.\n• clearly describe the building work that it is covering\n• state the address of where the proposed building work is to be carried out (exception for producer statements for proprietary building systems)\n• state the building code clauses that the building work will comply with\n• state the means of compliance used for assessing the building work’s compliance with the relevant building code clauses.\n• reference the drawings being covered\n• state any verification of design assumptions\n• state whether construction monitoring is to be undertaken by the design professional and precisely which building elements are to be inspected\n• state the author’s qualifications and registration number\n• be signed and dated",null,null,null,null,null,null,null,{"$f":"IF(F29=\"\",\"\",2)","v":""},null,null,null,null,{"$f":"IF(D29=\"RFI\",1,(IF(G29=\"NOT RESOLVED\",1,\"\")))","v":""}]
[null,"GENERAL:  "]
[null,6,"Structural Members - \nSizes\nDetailing",null,null,null,null,null,null,null,{"$f":"IF(F31=\"\",\"\",2)","v":""},null,"Specialist Review : Structural",null,null,{"$f":"IF(D31=\"RFI\",1,(IF(G31=\"NOT RESOLVED\",1,\"\")))","v":""}]
[null,7,"Bracing - \nUnits supplied\nPSD\nPlan",null,null,null,null,null,null,null,{"$f":"IF(F32=\"\",\"\",2)","v":""},null,null,null,null,{"$f":"IF(D32=\"RFI\",1,(IF(G32=\"NOT RESOLVED\",1,\"\")))","v":""}]
[null,8,"Other elements - \nSeismic resistance of building services\nTimber Barriers (outside scope B1/AS2\nWindows – 5 stories and above (wind pressure – NZS4211)\nDrains (support in soft ground)",null,null,null,null,null,null,null,{"$f":"IF(F33=\"\",\"\",2)","v":""},null,{"$f":"M31&\"  \"&L17&F39&L18","v":"Specialist Review : Structural  ()"},null,null,{"$f":"IF(D33=\"RFI\",1,(IF(G33=\"NOT RESOLVED\",1,\"\")))","v":""}]
[null,9,"Siteworks - \nSlope stability / Batters\nSurface Water Control / Driveways (hill sites only)",null,null,null,null,null,null,null,{"$f":"IF(F34=\"\",\"\",2)","v":""},null,null,null,null,{"$f":"IF(D34=\"RFI\",1,(IF(G34=\"NOT RESOLVED\",1,\"\")))","v":""}]
[null,"NZBC B1 AND B2:  (Note: Compliance with B1 = Compliance with B2)"]
[null,10,"B1 - Verification Method\nLoadings\nConcrete\nConcrete masonry\nSteel\nTimber\nAluminium\nEarth Buildings",null,null,null,null,null,null,null,{"$f":"IF(F36=\"\",\"\",2)","v":""},null,null,null,null,{"$f":"IF(D36=\"RFI\",1,(IF(G36=\"NOT RESOLVED\",1,\"\")))","v":""}]
[null,"10A","Additional Structure RFI placeholder","N/A",null,null,null,null,null,null,{"$f":"IF(F37=\"\",\"\",2)","v":""},null,null,null,null,{"$f":"IF(D37=\"RFI\",1,(IF(G37=\"NOT RESOLVED\",1,\"\")))","v":""}]
[null,"SPECIALIST REVIEW COMPLETED",null,null,null,"Specialist Name ","Status/Date Completed",null,null,null,null,null,null,null,null,{"$f":"SUM(P25:P37)","v":0}]
[null,null,"          Structural specialist officer review completed. \n          Ok to continue processing         ",null,{"$f":"IF(P38>0,\"NOTE: CHECKLIST INCOMPLETE - CANNOT SIGNOFF AT PRESENT\",\"\")","v":""},null,null,null,null,null,{"$f":"SUM(K25:K38)","v":0},null,null,null,null,null,null,null,null,null,null,null,null,null,false]
[null,null,"          Geotechnical specialist officer review completed (if applicable) \n          Ok to continue processing",null,{"$f":"IF(P24>0,\"NOTE: CHECKLIST INCOMPLETE - CANNOT SIGNOFF AT PRESENT\",\"\")","v":""},"Margaret Stoffel","2017-08-15",null,null,null,null,"ON HOLD",null,null,null,null,null,null,null,null,null,null,null,null,true]
[]
[]
[]
[]
[]
[]
[]
[]
[]
[]
[]
[]
[]
[]
[]
[]
[]
[]
[]
[]
[]
[]
[]
[]
[]
[]
[]
[]
[]
[]
[]
[]
[]
[]
[]
[]
[]
[]
[]
[]
[]
[]
[]
[]
[]
[]
[]
[]
[]
[]
[]
[]
[]
[]
[]
[]
[null,false]

{"sheet":"B462-Draft CS","index":6,"n_rows":769,"n_cols":11,"rows_kept":769,"cut":false,"hidden":false,"merged":[[10,8,10,9],[48,6,48,7],[49,6,49,7],[42,5,42,7],[43,6,43,7],[44,6,44,7],[45,6,45,7],[46,6,46,7],[32,6,32,7],[33,6,33,7],[34,6,34,7],[36,5,36,7],[37,5,37,7],[38,5,38,7],[39,5,39,7],[40,5,40,7],[41,5,41,7],[23,5,23,7],[24,5,24,7],[25,5,25,7],[26,5,26,7],[27,5,27,7],[28,6,28,7],[31,6,31,7],[20,4,20,7],[0,4,0,7],[1,4,1,7],[4,4,4,7],[15,4,15,7],[17,4,17,7],[18,4,18,7],[19,4,19,7],[22,5,22,7],[21,5,21,7],[29,6,29,7],[30,6,30,7],[56,5,56,7],[57,5,57,7],[58,6,58,7],[59,6,59,7],[60,6,60,7],[51,5,51,7],[52,5,52,7],[53,5,53,7],[54,5,54,7],[55,5,55,7],[67,5,67,7],[68,5,68,7],[69,5,69,7],[70,5,70,7],[71,5,71,7],[61,6,61,7],[62,6,62,7],[63,6,63,7],[64,6,64,7],[66,5,66,7],[77,6,77,7],[78,6,78,7],[79,6,79,7],[81,5,81,7],[82,5,82,7],[72,5,72,7],[73,6,73,7],[74,6,74,7],[75,6,75,7],[76,6,76,7],[88,6,88,7],[89,6,89,7],[90,6,90,7],[91,6,91,7],[92,6,92,7],[83,5,83,7],[84,5,84,7],[85,5,85,7],[86,5,86,7],[87,5,87,7],[99,5,99,7],[100,5,100,7],[101,5,101,7],[102,5,102,7],[103,6,103,7],[93,6,93,7],[94,6,94,7],[96,5,96,7],[97,5,97,7],[98,5,98,7],[109,6,109,7],[111,5,111,7],[112,5,112,7],[113,5,113,7],[114,5,114,7],[104,6,104,7],[105,6,105,7],[106,6,106,7],[107,6,107,7],[108,6,108,7],[120,6,120,7],[121,6,121,7],[122,6,122,7],[123,6,123,7],[124,6,124,7],[115,5,115,7],[116,5,116,7],[117,5,117,7],[118,6,118,7],[119,6,119,7],[131,5,131,7],[132,5,132,7],[133,6,133,7],[134,6,134,7],[135,6,135,7],[126,5,126,7],[127,5,127,7],[128,5,128,7],[129,5,129,7],[130,5,130,7],[142,5,142,7],[143,5,143,7],[144,5,144,7],[145,5,145,7],[146,5,146,7],[136,6,136,7],[137,6,137,7],[138,6,138,7],[139,6,139,7],[141,5,141,7],[152,6,152,7],[153,6,153,7],[154,6,154,7],[156,5,156,7],[157,5,157,7],[147,5,147,7],[148,6,148,7],[149,6,149,7],[150,6,150,7],[151,6,151,7],[163,6,163,7],[164,6,164,7],[165,6,165,7],[166,6,166,7],[167,6,167,7],[158,5,158,7],[159,5,159,7],[160,5,160,7],[161,5,161,7],[162,5,162,7],[174,5,174,7],[175,5,175,7],[176,5,176,7],[177,5,177,7],[178,6,178,7],[168,6,168,7],[169,6,169,7],[171,5,171,7],[172,5,172,7],[173,5,173,7],[184,6,184,7],[186,5,186,7],[187,5,187,7],[188,5,188,7],[189,5,189,7],[179,6,179,7],[180,6,180,7],[181,6,181,7],[182,6,182,7],[183,6,183,7],[195,6,195,7],[196,6,196,7],[197,6,197,7],[198,6,198,7],[199,6,199,7],[190,5,190,7],[191,5,191,7],[192,5,192,7],[193,6,193,7],[194,6,194,7],[206,5,206,7],[207,5,207,7],[208,6,208,7],[209,6,209,7],[210,6,210,7],[201,5,201,7],[202,5,202,7],[203,5,203,7],[204,5,204,7],[205,5,205,7],[217,5,217,7],[218,5,218,7],[219,5,219,7],[220,5,220,7],[221,5,221,7],[211,6,211,7],[212,6,212,7],[213,6,213,7],[214,6,214,7],[216,5,216,7],[227,6,227,7],[228,6,228,7],[229,6,229,7],[231,5,231,7],[232,5,232,7],[222,5,222,7],[223,6,223,7],[224,6,224,7],[225,6,225,7],[226,6,226,7],[238,6,238,7],[239,6,239,7],[240,6,240,7],[241,6,241,7],[242,6,242,7],[233,5,233,7],[234,5,234,7],[235,5,235,7],[236,5,236,7],[237,5,237,7],[249,5,249,7],[250,5,250,7],[251,5,251,7],[252,5,252,7],[253,6,253,7],[243,6,243,7],[244,6,244,7],[246,5,246,7],[247,5,247,7],[248,5,248,7],[259,6,259,7],[261,5,261,7],[262,5,262,7],[263,5,263,7],[264,5,264,7],[254,6,254,7],[255,6,255,7],[256,6,256,7],[257,6,257,7],[258,6,258,7],[270,6,270,7],[271,6,271,7],[272,6,272,7],[273,6,273,7],[274,6,274,7],[265,5,265,7],[266,5,266,7],[267,5,267,7],[268,6,268,7],[269,6,269,7],[281,5,281,7],[282,5,282,7],[283,6,283,7],[284,6,284,7],[285,6,285,7],[276,5,276,7],[277,5,277,7],[278,5,278,7],[279,5,279,7],[280,5,280,7],[292,5,292,7],[293,5,293,7],[294,5,294,7],[295,5,295,7],[296,5,296,7],[286,6,286,7],[287,6,287,7],[288,6,288,7],[289,6,289,7],[291,5,291,7],[302,6,302,7],[303,6,303,7],[304,6,304,7],[306,5,306,7],[307,5,307,7],[297,5,297,7],[298,6,298,7],[299,6,299,7],[300,6,300,7],[301,6,301,7],[313,6,313,7],[314,6,314,7],[315,6,315,7],[316,6,316,7],[317,6,317,7],[308,5,308,7],[309,5,309,7],[310,5,310,7],[311,5,311,7],[312,5,312,7],[324,5,324,7],[325,5,325,7],[326,5,326,7],[327,5,327,7],[328,6,328,7],[318,6,318,7],[319,6,319,7],[321,5,321,7],[322,5,322,7],[323,5,323,7],[334,6,334,7],[336,5,336,7],[337,5,337,7],[338,5,338,7],[339,5,339,7],[329,6,329,7],[330,6,330,7],[331,6,331,7],[332,6,332,7],[333,6,333,7],[345,6,345,7],[346,6,346,7],[347,6,347,7],[348,6,348,7],[349,6,349,7],[340,5,340,7],[341,5,341,7],[342,5,342,7],[343,6,343,7],[344,6,344,7],[356,5,356,7],[357,5,357,7],[358,6,358,7],[359,6,359,7],[360,6,360,7],[351,5,351,7],[352,5,352,7],[353,5,353,7],[354,5,354,7],[355,5,355,7],[367,5,367,7],[368,5,368,7],[369,5,369,7],[370,5,370,7],[371,5,371,7],[361,6,361,7],[362,6,362,7],[363,6,363,7],[364,6,364,7],[366,5,366,7],[377,6,377,7],[378,6,378,7],[379,6,379,7],[381,5,381,7],[382,5,382,7],[372,5,372,7],[373,6,373,7],[374,6,374,7],[375,6,375,7],[376,6,376,7],[388,6,388,7],[389,6,389,7],[390,6,390,7],[391,6,391,7],[392,6,392,7],[383,5,383,7],[384,5,384,7],[385,5,385,7],[386,5,386,7],[387,5,387,7],[399,5,399,7],[400,5,400,7],[401,5,401,7],[402,5,402,7],[403,6,403,7],[393,6,393,7],[394,6,394,7],[396,5,396,7],[397,5,397,7],[398,5,398,7],[409,6,409,7],[411,5,411,7],[412,5,412,7],[413,5,413,7],[414,5,414,7],[404,6,404,7],[405,6,405,7],[406,6,406,7],[407,6,407,7],[408,6,408,7],[420,6,420,7],[421,6,421,7],[422,6,422,7],[423,6,423,7],[424,6,424,7],[415,5,415,7],[416,5,416,7],[417,5,417,7],[418,6,418,7],[419,6,419,7],[431,5,431,7],[432,5,432,7],[433,6,433,7],[434,6,434,7],[435,6,435,7],[426,5,426,7],[427,5,427,7],[428,5,428,7],[429,5,429,7],[430,5,430,7],[442,5,442,7],[443,5,443,7],[444,5,444,7],[445,5,445,7],[446,5,446,7],[436,6,436,7],[437,6,437,7],[438,6,438,7],[439,6,439,7],[441,5,441,7],[452,6,452,7],[453,6,453,7],[454,6,454,7],[456,5,456,7],[457,5,457,7],[447,5,447,7],[448,6,448,7],[449,6,449,7],[450,6,450,7],[451,6,451,7],[463,6,463,7],[464,6,464,7],[465,6,465,7],[466,6,466,7],[467,6,467,7],[458,5,458,7],[459,5,459,7],[460,5,460,7],[461,5,461,7],[462,5,462,7],[474,5,474,7],[475,5,475,7],[476,5,476,7],[477,5,477,7],[478,6,478,7],[468,6,468,7],[469,6,469,7],[471,5,471,7],[472,5,472,7],[473,5,473,7],[484,6,484,7],[486,5,486,7],[487,5,487,7],[488,5,488,7],[489,5,489,7],[479,6,479,7],[480,6,480,7],[481,6,481,7],[482,6,482,7],[483,6,483,7],[495,6,495,7],[496,6,496,7],[497,6,497,7],[498,6,498,7],[499,6,499,7],[490,5,490,7],[491,5,491,7],[492,5,492,7],[493,6,493,7],[494,6,494,7],[506,5,506,7],[507,5,507,7],[508,6,508,7],[509,6,509,7],[510,6,510,7],[501,5,501,7],[502,5,502,7],[503,5,503,7],[504,5,504,7],[505,5,505,7],[517,5,517,7],[518,5,518,7],[519,5,519,7],[520,5,520,7],[521,5,521,7],[511,6,511,7],[512,6,512,7],[513,6,513,7],[514,6,514,7],[516,5,516,7],[527,6,527,7],[528,6,528,7],[529,6,529,7],[531,5,531,7],[532,5,532,7],[522,5,522,7],[523,6,523,7],[524,6,524,7],[525,6,525,7],[526,6,526,7],[538,6,538,7],[539,6,539,7],[540,6,540,7],[541,6,541,7],[542,6,542,7],[533,5,533,7],[534,5,534,7],[535,5,535,7],[536,5,536,7],[537,5,537,7],[549,5,549,7],[550,5,550,7],[551,5,551,7],[552,5,552,7],[553,6,553,7],[543,6,543,7],[544,6,544,7],[546,5,546,7],[547,5,547,7],[548,5,548,7],[559,6,559,7],[561,5,561,7],[562,5,562,7],[563,5,563,7],[564,5,564,7],[554,6,554,7],[555,6,555,7],[556,6,556,7],[557,6,557,7],[558,6,558,7],[570,6,570,7],[571,6,571,7],[572,6,572,7],[573,6,573,7],[574,6,574,7],[565,5,565,7],[566,5,566,7],[567,5,567,7],[568,6,568,7],[569,6,569,7],[581,5,581,7],[582,5,582,7],[583,6,583,7],[584,6,584,7],[585,6,585,7],[576,5,576,7],[577,5,577,7],[578,5,578,7],[579,5,579,7],[580,5,580,7],[592,5,592,7],[593,5,593,7],[594,5,594,7],[595,5,595,7],[596,5,596,7],[586,6,586,7],[587,6,587,7],[588,6,588,7],[589,6,589,7],[591,5,591,7],[602,6,602,7],[603,6,603,7],[604,6,604,7],[606,5,606,7],[607,5,607,7],[597,5,597,7],[598,6,598,7],[599,6,599,7],[600,6,600,7],[601,6,601,7],[613,6,613,7],[614,6,614,7],[615,6,615,7],[616,6,616,7],[617,6,617,7],[608,5,608,7],[609,5,609,7],[610,5,610,7],[611,5,611,7],[612,5,612,7],[624,5,624,7],[625,5,625,7],[626,5,626,7],[627,5,627,7],[628,6,628,7],[618,6,618,7],[619,6,619,7],[621,5,621,7],[622,5,622,7],[623,5,623,7],[640,5,640,7],[641,5,641,7],[642,5,642,7],[643,5,643,7],[644,6,644,7],[635,6,635,7],[629,6,629,7],[637,5,637,7],[638,5,638,7],[639,5,639,7],[630,6,630,7],[631,6,631,7],[632,6,632,7],[633,6,633,7],[634,6,634,7],[650,6,650,7],[652,5,652,7],[653,5,653,7],[654,5,654,7],[655,5,655,7],[645,6,645,7],[646,6,646,7],[647,6,647,7],[648,6,648,7],[649,6,649,7],[661,6,661,7],[662,6,662,7],[663,6,663,7],[664,6,664,7],[665,6,665,7],[656,5,656,7],[657,5,657,7],[658,5,658,7],[659,6,659,7],[660,6,660,7],[672,5,672,7],[673,5,673,7],[674,6,674,7],[675,6,675,7],[676,6,676,7],[667,5,667,7],[668,5,668,7],[669,5,669,7],[670,5,670,7],[671,5,671,7],[683,5,683,7],[684,5,684,7],[685,5,685,7],[686,5,686,7],[687,5,687,7],[677,6,677,7],[678,6,678,7],[679,6,679,7],[680,6,680,7],[682,5,682,7],[693,6,693,7],[694,6,694,7],[695,6,695,7],[697,5,697,7],[698,5,698,7],[688,5,688,7],[689,6,689,7],[690,6,690,7],[691,6,691,7],[692,6,692,7],[704,6,704,7],[705,6,705,7],[706,6,706,7],[707,6,707,7],[708,6,708,7],[699,5,699,7],[700,5,700,7],[701,5,701,7],[702,5,702,7],[703,5,703,7],[715,5,715,7],[716,5,716,7],[717,5,717,7],[718,5,718,7],[719,6,719,7],[709,6,709,7],[710,6,710,7],[712,5,712,7],[713,5,713,7],[714,5,714,7],[725,6,725,7],[727,5,727,7],[728,5,728,7],[729,5,729,7],[730,5,730,7],[720,6,720,7],[721,6,721,7],[722,6,722,7],[723,6,723,7],[724,6,724,7],[736,6,736,7],[737,6,737,7],[738,6,738,7],[739,6,739,7],[740,6,740,7],[731,5,731,7],[732,5,732,7],[733,5,733,7],[734,6,734,7],[735,6,735,7],[741,5,741,7],[742,5,742,7],[743,5,743,7],[744,5,744,7],[745,5,745,7],[746,5,746,7],[747,5,747,7],[748,6,748,7],[749,6,749,7],[750,6,750,7],[751,6,751,7],[752,6,752,7],[753,6,753,7],[754,6,754,7],[755,5,755,7],[756,5,756,7],[757,5,757,7],[758,5,758,7],[768,6,768,7],[759,5,759,7],[760,5,760,7],[761,5,761,7],[762,6,762,7],[763,6,763,7],[764,6,764,7],[765,6,765,7],[766,6,766,7],[767,6,767,7]]}
[null,null,null,null,"Draft Compliance Schedule",null,null,null,null,null,"• CS\n• CL\n• CO\n• CM\n• SC\n• SD\n• SR\n• SA\n• SH\n• WL\n• WM\n• WH\n• WF\n• IE\n• IA\n• ID"]
[null,null,null,null,"Issued in accordance with Section 51, Building Act 2004",null,null,null,null,null,"New"]
[null,null,null,null,null,null,null,null,null,null,"Existing"]
[null,null,null,null,"Project number",{"$f":"'Summary sheet'!$E$15","v":"BCN/2017/2013"},"Date issued",{"$f":"TODAY()","v":"2017-08-20"},"Summary sheet","B501-Not accepted letter","Altered"]
[null,null,null,null,"The building",null,null,null,"Vetting sheet","B501a-Not accepted with invoice","New and existing"]
[null,null,null,null,"Street address",{"$f":"'Summary sheet'!$E$16","v":"80 Byron Street Sydenham "},"Level/unit number",null,"B120-Processing sheet","Application update letter","New and altered"]
[null,null,null,null,"Legal description","Lot 1 DP 449853",null,null,"B150-Structural specialist","B521-RFI letter","New, existing and altered"]
[null,null,null,null,"Building name",null,"Current, lawfully established use",null,"B151a-Fire safety specialist","B529-Final reminder letter","Existing and altered"]
[null,null,null,null,"Location within site/block number",null,"Property ID",1384926,"B151b-Fire safety specialist","B532-Refusal letter","Removed"]
[null,null,null,null,null,null,"Owner ID",4106179,"B160-PS specialist","S71-74 natural hazards","Y"]
[null,null,null,null,"Intended life of building if less than 50 years",null,"Existing compliance schedule number",null,"B462-Draft CS"]
[null,null,null,null,"Intended use",null,"Year first constructed"]
[null,null,null,null,"Occupant load","16 people","Highest fire hazard category","FHC3"]
[null,null,null,null,"Conditions of use","Factory, office, store areas (3m max. Signage required)"]
[]
[null,null,null,null,"Use(s) (as per Schedule 2, Building Regulations 2005)"]
[null,null,null,null,"• WL/WM"]
["Type","Description","Required\n'Y'",null,"This draft compliance schedule is issued by Christchurch City Council under Section 51 of the Building Act 2004 for inclusion with the building consent. It will be used as a basis for the compliance schedule statement or amended compliance schedule which will be used with the code compliance certificate, as per Section 102 Building Act 2004."]
["*","Attachments",null,null,"Attachments"]
[null,"*",{"$f":"$C$19","v":0}]
["*","List of specified systems","*",null,"List of specified systems"]
["SPEC1A","1a: Sprinkler system NZS 4541:2007",null,null,"Specified System 1","Automatic systems for fire suppression"]
[null,null,{"$f":"$C$22","v":0},null,"Modified by"]
[null,null,0,null,"Description and type","Sprinkler system NZS 4541:2007 "]
[null,null,0,null,"Location"]
[null,null,0,null,"Make (if known)"]
[null,null,0,null,"Model number (if known)"]
[null,null,0,null,"Maintenance procedure and performance standards","As specified by NZS 4541:2007"]
[null,null,0,null,"Inspections","Frequency","Maintained or inspected by"]
[null,null,0,null,null,"Daily"]
[null,null,0,null,null,"Weekly"]
[null,null,0,null,null,"Monthly","Independent qualified person"]
[null,null,0,null,null,"3 Monthly"]
[null,null,0,null,null,"6 Monthly"]
[null,null,0,null,null,"Yearly","Independent qualified person"]
[null,null,0]
["SPEC1B","1b: Sprinkler system complying w C/AS1 Appendix D",null,null,"Specified System 1","Automatic systems for fire suppression"]
[null,null,{"$f":"$C$37","v":0},null,"Modified by"]
[null,null,0,null,"Description and type","Sprinkler system NZS 4541:2007 amended by Appendix D of Acceptable Solution C/AS1 installed up to 9 April 2013"]
[null,null,0,null,"Location"]
[null,null,0,null,"Make (if known)"]
[null,null,0,null,"Model number (if known)"]
[null,null,0,null,"Maintenance procedure and performance standards","As specified by NZS 4541:2007"]
[null,null,0,null,"Inspections","Frequency","Maintained or inspected by"]
[null,null,0,null,null,"Daily"]
[null,null,0,null,null,"Weekly"]
[null,null,0,null,null,"Monthly","Independent qualified person"]
[null,null,0,null,null,"3 Monthly"]
[null,null,0,null,null,"6 Monthly"]
[null,null,0,null,null,"Yearly","Independent qualified person"]
[null,null,0]
["SPEC1C","1c: Sprinkler system complying w C/AS1 Appendix B",null,null,"Specified System 1","Automatic systems for fire suppression"]
[null,null,{"$f":"$C$52","v":0},null,"Modified by"]
[null,null,0,null,"Description and type","Sprinkler system NZS 4541:2007 amended by Appendix D of Acceptable Solution C/AS1 installed up to 9 April 2013"]
[null,null,0,null,"Location"]
[null,null,0,null,"Make (if known)"]
[null,null,0,null,"Model number (if known)"]
[null,null,0,null,"Maintenance procedure and performance standards","As specified by NZS 4541:2007"]
[null,null,0,null,"Inspections","Frequency","Maintained or inspected by"]
[null,null,0,null,null,"Daily"]
[null,null,0,null,null,"Weekly"]
[null,null,0,null,null,"Monthly","Independent qualified person"]
[null,null,0,null,null,"3 Monthly"]
[null,null,0,null,null,"6 Monthly"]
[null,null,0,null,null,"Yearly","Independent qualified person"]
[null,null,0]
["SPEC1D","1d: Residential sprinkler & backflow",null,null,"Specified System 1","Automatic systems for fire suppression"]
[null,null,{"$f":"$C$67","v":0},null,"Modified by"]
[null,null,0,null,"Description and type","Residential sprinkler system NZS 4515:2003 and AS 2845 Part 3 (Backflow)"]
[null,null,0,null,"Location"]
[null,null,0,null,"Make (if known)"]
[null,null,0,null,"Model number (if known)"]
[null,null,0,null,"Maintenance procedure and performance standards","As specified by NZS 4515:2003"]
[null,null,0,null,"Inspections","Frequency","Maintained or inspected by"]
[null,null,0,null,null,"Daily"]
[null,null,0,null,null,"Weekly"]
[null,null,0,null,null,"Monthly","Independent qualified person"]
[null,null,0,null,null,"3 Monthly"]
[null,null,0,null,null,"6 Monthly"]
[null,null,0,null,null,"Yearly","Independent qualified person"]
[null,null,0]
["SPEC1E","1e: Residential sprinkler & backflow - C/AS1 App D",null,null,"Specified System 1","Automatic systems for fire suppression"]
[null,null,{"$f":"$C$82","v":0},null,"Modified by"]
[null,null,0,null,"Description and type","Residential sprinkler system NZS 4515:2003 and AS 2845 Part 3 (Backflow) complying with Appendix D of Acceptable Solution C/AS1 installed up to 9 April 2013"]
[null,null,0,null,"Location"]
[null,null,0,null,"Make (if known)"]
[null,null,0,null,"Model number (if known)"]
[null,null,0,null,"Maintenance procedure and performance standards","As specified by NZS 4515:2003"]
[null,null,0,null,"Inspections","Frequency","Maintained or inspected by"]
[null,null,0,null,null,"Daily"]
[null,null,0,null,null,"Weekly"]
[null,null,0,null,null,"Monthly","Independent qualified person"]
[null,null,0,null,null,"3 Monthly"]
[null,null,0,null,null,"6 Monthly"]
[null,null,0,null,null,"Yearly","Independent qualified person"]
[null,null,0]
["SPEC1F","1f: Residential sprinkler & backflow - C/AS1 App B",null,null,"Specified System 1","Automatic systems for fire suppression"]
[null,null,{"$f":"$C$97","v":0},null,"Modified by"]
[null,null,0,null,"Description and type","Residential sprinkler System NZS 4515:2003 and AS 2845 Part 3 (Backflow) complying with Appendix B of Acceptable Solution C/AS1 to C/AS6 from 10 April 2012"]
[null,null,0,null,"Location"]
[null,null,0,null,"Make (if known)"]
[null,null,0,null,"Model number (if known)"]
[null,null,0,null,"Maintenance procedure and performance standards","As specified by NZS 4515:2003"]
[null,null,0,null,"Inspections","Frequency","Maintained or inspected by"]
[null,null,0,null,null,"Daily"]
[null,null,0,null,null,"Weekly"]
[null,null,0,null,null,"Monthly","Independent qualified person"]
[null,null,0,null,null,"3 Monthly"]
[null,null,0,null,null,"6 Monthly"]
[null,null,0,null,null,"Yearly","Independent qualified person"]
[null,null,0]
["SPEC1G","1g: Gaseous fire extinguishing system",null,null,"Specified System 1","Automatic systems for fire suppression"]
[null,null,{"$f":"$C$112","v":0},null,"Modified by"]
[null,null,0,null,"Description and type","Gaseous fire extinguishing system in accordance with AS 1851:2005"]
[null,null,0,null,"Location"]
[null,null,0,null,"Make (if known)"]
[null,null,0,null,"Model number (if known)"]
[null,null,0,null,"Maintenance procedure and performance standards","As specified by AS 1851:2005"]
[null,null,0,null,"Inspections","Frequency","Maintained or inspected by"]
[null,null,0,null,null,"Daily"]
[null,null,0,null,null,"Weekly"]
[null,null,0,null,null,"Monthly","Independent qualified person"]
[null,null,0,null,null,"3 Monthly"]
[null,null,0,null,null,"6 Monthly"]
[null,null,0,null,null,"Yearly","Independent qualified person"]
[null,null,0]
["SPEC1H","1h: Ansul foam suppression system",null,null,"Specified System 1","Automatic systems for fire suppression"]
[null,null,{"$f":"$C$127","v":0},null,"Modified by"]
[null,null,0,null,"Description and type","Ansul foam suppression system to the manufacturer’s requirements"]
[null,null,0,null,"Location"]
[null,null,0,null,"Make (if known)"]
[null,null,0,null,"Model number (if known)"]
[null,null,0,null,"Maintenance procedure and performance standards","As specified by AS 1851:2005\nAnd as required by NZS 4512:2012"]
[null,null,0,null,"Inspections","Frequency","Maintained or inspected by"]
[null,null,0,null,null,"Daily"]
[null,null,0,null,null,"Weekly"]
[null,null,0,null,null,"Monthly","Independent qualified person"]
[null,null,0,null,null,"3 Monthly"]
[null,null,0,null,null,"6 Monthly","Independent qualified person"]
[null,null,0,null,null,"Yearly","Independent qualified person"]
[null,null,0]
["SPEC1I","1i: Household sprinkler system with backflow",null,null,"Specified System 1","Automatic systems for fire suppression"]
[null,null,{"$f":"$C$142","v":0},null,"Modified by"]
[null,null,0,null,"Description and type","Household sprinkler system complying with NZS 4517:2002 with backflow prevention to NZS 2845.3"]
[null,null,0,null,"Location"]
[null,null,0,null,"Make (if known)"]
[null,null,0,null,"Model number (if known)"]
[null,null,0,null,"Maintenance procedure and performance standards","As specified by NZS 4517:2002"]
[null,null,0,null,"Inspections","Frequency","Maintained or inspected by"]
[null,null,0,null,null,"Daily"]
[null,null,0,null,null,"Weekly"]
[null,null,0,null,null,"Monthly","Independent qualified person"]
[null,null,0,null,null,"3 Monthly"]
[null,null,0,null,null,"6 Monthly"]
[null,null,0,null,null,"Yearly","Independent qualified person"]
[null,null,0]
["SPEC2A","2a: Type 2 manual fire alarm system",null,null,"Specified System 2","Emergency warning systems for fire or other emergencies"]
[null,null,{"$f":"$C$157","v":0},null,"Modified by"]
[null,null,0,null,"Description and type","Type 2 manual fire alarm system complying with NZS 4512:2010"]
[null,null,0,null,"Location"]
[null,null,0,null,"Make (if known)"]
[null,null,0,null,"Model number (if known)"]
[null,null,0,null,"Maintenance procedure and performance standards","As specified by NZS 4512:2010"]
[null,null,0,null,"Inspections","Frequency","Maintained or inspected by"]
[null,null,0,null,null,"Daily"]
[null,null,0,null,null,"Weekly"]
[null,null,0,null,null,"Monthly","Independent qualified person"]
[null,null,0,null,null,"3 Monthly"]
[null,null,0,null,null,"6 Monthly"]
[null,null,0,null,null,"Yearly","Independent qualified person"]
[null,null,0]
["SPEC2B","2b: Type 2 manual fire alarm system - F7/AS1",null,null,"Specified System 2","Emergency warning systems for fire or other emergencies"]
[null,null,{"$f":"$C$172","v":0},null,"Modified by"]
[null,null,0,null,"Description and type","Type 2 manual fire alarm system complying with NZS 4512:2010 as amended by F7/AS1 1.1.1.2 installed up to 9 April 2013"]
[null,null,0,null,"Location"]
[null,null,0,null,"Make (if known)"]
[null,null,0,null,"Model number (if known)"]
[null,null,0,null,"Maintenance procedure and performance standards","As specified by NZS 4512:2010"]
[null,null,0,null,"Inspections","Frequency","Maintained or inspected by"]
[null,null,0,null,null,"Daily"]
[null,null,0,null,null,"Weekly"]
[null,null,0,null,null,"Monthly","Independent qualified person"]
[null,null,0,null,null,"3 Monthly"]
[null,null,0,null,null,"6 Monthly"]
[null,null,0,null,null,"Yearly","Independent qualified person"]
[null,null,0]
["SPEC2C","2c: Type 3 auto fire alarm & heat detectors",null,null,"Specified System 2","Emergency warning systems for fire or other emergencies"]
[null,null,{"$f":"$C$187","v":0},null,"Modified by"]
[null,null,0,null,"Description and type","Type 3 automatic fire alarm system activated by heat detectors and manual call points complying with NZS 4512:2010"]
[null,null,0,null,"Location"]
[null,null,0,null,"Make (if known)"]
[null,null,0,null,"Model number (if known)"]
[null,null,0,null,"Maintenance procedure and performance standards","As specified by NZS 4512:2010"]
[null,null,0,null,"Inspections","Frequency","Maintained or inspected by"]
[null,null,0,null,null,"Daily"]
[null,null,0,null,null,"Weekly"]
[null,null,0,null,null,"Monthly","Independent qualified person"]
[null,null,0,null,null,"3 Monthly"]
[null,null,0,null,null,"6 Monthly"]
[null,null,0,null,null,"Yearly","Independent qualified person"]
[null,null,0]
["SPEC2D","2d: Type 4 auto fire alarm & smoke detectors",null,null,"Specified System 2","Emergency warning systems for fire or other emergencies"]
[null,null,{"$f":"$C$202","v":0},null,"Modified by"]
[null,null,0,null,"Description and type","Type 4 automatic fire alarm system activated by smoke detectors and manual call points complying with NZS 4512:2010"]
[null,null,0,null,"Location"]
[null,null,0,null,"Make (if known)"]
[null,null,0,null,"Model number (if known)"]
[null,null,0,null,"Maintenance procedure and performance standards","As specified by NZS 4512:2010"]
[null,null,0,null,"Inspections","Frequency","Maintained or inspected by"]
[null,null,0,null,null,"Daily"]
[null,null,0,null,null,"Weekly"]
[null,null,0,null,null,"Monthly","Independent qualified person"]
[null,null,0,null,null,"3 Monthly"]
[null,null,0,null,null,"6 Monthly"]
[null,null,0,null,null,"Yearly","Independent qualified person"]
[null,null,0]
["SPEC2E","2e: Type 5 auto fire alarm & modified smoke detect",null,null,"Specified System 2","Emergency warning systems for fire or other emergencies"]
[null,null,{"$f":"$C$217","v":0},null,"Modified by"]
[null,null,0,null,"Description and type","Type 5 automatic fire alarm system with modified smoke detection and manual call points complying with NZS 4512:2010"]
[null,null,0,null,"Location"]
[null,null,0,null,"Make (if known)"]
[null,null,0,null,"Model number (if known)"]
[null,null,0,null,"Maintenance procedure and performance standards","As specified by NZS 4512:2010"]
[null,null,0,null,"Inspections","Frequency","Maintained or inspected by"]
[null,null,0,null,null,"Daily"]
[null,null,0,null,null,"Weekly"]
[null,null,0,null,null,"Monthly","Independent qualified person"]
[null,null,0,null,null,"3 Monthly"]
[null,null,0,null,null,"6 Monthly"]
[null,null,0,null,null,"Yearly","Independent qualified person"]
[null,null,0]
["SPEC2F","2f: Stand-alone battery-power manual alarms",null,null,"Specified System 2","Emergency warning systems for fire or other emergencies"]
[null,null,{"$f":"$C$232","v":0},null,"Modified by"]
[null,null,0,null,"Description and type","Stand-alone battery-powered manual alarms"]
[null,null,0,null,"Location"]
[null,null,0,null,"Make (if known)"]
[null,null,0,null,"Model number (if known)"]
[null,null,0,null,"Maintenance procedure and performance standards","As specified by NZS 4561 Appendix A"]
[null,null,0,null,"Inspections","Frequency","Maintained or inspected by"]
[null,null,0,null,null,"Daily"]
[null,null,0,null,null,"Weekly"]
[null,null,0,null,null,"Monthly","Independent qualified person"]
[null,null,0,null,null,"3 Monthly"]
[null,null,0,null,null,"6 Monthly"]
[null,null,0,null,null,"Yearly","Independent qualified person"]
[null,null,0]
["SPEC2G","2g: Domestic interconnected smoke alarms",null,null,"Specified System 2","Emergency warning systems for fire or other emergencies"]
[null,null,{"$f":"$C$247","v":0},null,"Modified by"]
[null,null,0,null,"Description and type","Domestic interconnected smoke alarms complying with NZS 4514:2009"]
[null,null,0,null,"Location","Located throughout building to comply with the location requirements of NZS 4514:2009"]
[null,null,0,null,"Make (if known)"]
[null,null,0,null,"Model number (if known)"]
[null,null,0,null,"Maintenance procedure and performance standards","As specified by NZS 4514:2009"]
[null,null,0,null,"Inspections","Frequency","Maintained or inspected by"]
[null,null,0,null,null,"Daily"]
[null,null,0,null,null,"Weekly"]
[null,null,0,null,null,"Monthly","Owner"]
[null,null,0,null,null,"3 Monthly","Owner"]
[null,null,0,null,null,"6 Monthly"]
[null,null,0,null,null,"Yearly","Independent qualified person"]
[null,null,0]
["SPEC2H","2h: Security system with evacuation warning",null,null,"Specified System 2","Emergency warning systems for fire or other emergencies"]
[null,null,{"$f":"$C$262","v":0},null,"Modified by"]
[null,null,0,null,"Description and type","Security system for fire or other dangers providing an evacuation warning in the building"]
[null,null,0,null,"Location"]
[null,null,0,null,"Make (if known)"]
[null,null,0,null,"Model number (if known)"]
[null,null,0,null,"Maintenance procedure and performance standards","Visual check per month by owner to inspect smoke detectors have not been isolated, damaged or removed.\nService provider to inspect to manufacturer’s recommendations every 6 months.\n"]
[null,null,0,null,"Inspections","Frequency","Maintained or inspected by"]
[null,null,0,null,null,"Daily"]
[null,null,0,null,null,"Weekly"]
[null,null,0,null,null,"Monthly","Owner"]
[null,null,0,null,null,"3 Monthly"]
[null,null,0,null,null,"6 Monthly","Service provider"]
[null,null,0,null,null,"Yearly","Independent qualified person"]
[null,null,0]
["SPEC3A","3a: Automatic doors",null,null,"Specified System 3/1","Electromagnetic or automatic doors or windows"]
[null,null,{"$f":"$C$277","v":0},null,"Modified by"]
[null,null,0,null,"Description and type","Automatic doors complying with AS 4085:1992, NZS 4239:1996 Appendix A"]
[null,null,0,null,"Location"]
[null,null,0,null,"Make (if known)"]
[null,null,0,null,"Model number (if known)"]
[null,null,0,null,"Maintenance procedure and performance standards","Auto doors shall be inspected to ensure that they open correctly during normal use, and if applicable the failsafe feature works when the power is isolated. Any defects to failsafe doors shall be rectified immediately. AS 4085:1992, NZS 4239:1996 Appendix A.\n"]
[null,null,0,null,"Inspections","Frequency","Maintained or inspected by"]
[null,null,0,null,null,"Daily"]
[null,null,0,null,null,"Weekly"]
[null,null,0,null,null,"Monthly","Owner"]
[null,null,0,null,null,"3 Monthly"]
[null,null,0,null,null,"6 Monthly"]
[null,null,0,null,null,"Yearly","Independent qualified person"]
[null,null,0]
["SPEC3B","3b: Access controlled doors",null,null,"Specified System 3/2","Electromagnetic or automatic doors or windows"]
[null,null,{"$f":"$C$292","v":0},null,"Modified by"]
[null,null,0,null,"Description and type","Access controlled doors"]
[null,null,0,null,"Location"]
[null,null,0,null,"Make (if known)"]
[null,null,0,null,"Model number (if known)"]
[null,null,0,null,"Maintenance procedure and performance standards","Access controlled doors require regular inspections specified by the manufacturer or supplier to ensure that occupants are not prevented from leaving the building due to lock malfunction and are able to leave the building without the use of swipe cards etc. in event of emergency.\nWhere the door control system is interfaced to the fire alarm system this needs to be checked at the same time.\nPlease also refer to the Ministry of Business, Innovation and Employment  Compliance Schedule Handbook (May 2007 – Page 23).\n"]
[null,null,0,null,"Inspections","Frequency","Maintained or inspected by"]
[null,null,0,null,null,"Daily","Owner (Crowd groups) "]
[null,null,0,null,null,"Weekly"]
[null,null,0,null,null,"Monthly","Owner (Other occupancies)"]
[null,null,0,null,null,"3 Monthly"]
[null,null,0,null,null,"6 Monthly"]
[null,null,0,null,null,"Yearly","Independent qualified person"]
[null,null,0]
["SPEC3C","3c: Automatic fire doors or windows",null,null,"Specified System 3/3","Electromagnetic or automatic doors or windows"]
[null,null,{"$f":"$C$307","v":0},null,"Modified by"]
[null,null,0,null,"Description and type","Automatic fire doors or windows forming part of fire wall, which are designed to close shut and remain shut on alarm of fire including smoke control doors fitted with hold open devices."]
[null,null,0,null,"Location"]
[null,null,0,null,"Make (if known)"]
[null,null,0,null,"Model number (if known)"]
[null,null,0,null,"Maintenance procedure and performance standards","Visual inspection to ensure that doors are in good working order and as required by compliance document C/AS1 (2012) or C/AS2—C/AS6, and as specified by AS 1851:2005.\n"]
[null,null,0,null,"Inspections","Frequency","Maintained or inspected by"]
[null,null,0,null,null,"Daily"]
[null,null,0,null,null,"Weekly"]
[null,null,0,null,null,"Monthly","Independent qualified person"]
[null,null,0,null,null,"3 Monthly"]
[null,null,0,null,null,"6 Monthly"]
[null,null,0,null,null,"Yearly","Independent qualified person"]
[null,null,0]
["SPEC4A","4a: Emergency lighting system, 1995 or later","Y",null,"Specified System 4","Emergency lighting systems"]
[null,null,{"$f":"$C$322","v":"Y"},null,"Modified by","New"]
[null,null,"Y",null,"Description and type","Emergency lighting system – systems installed from 1995 complying with AS/NZS 2293 Part 1, 2 & 3"]
[null,null,"Y",null,"Location","Changes in level and escape routes as per F6/AS1"]
[null,null,"Y",null,"Make (if known)"]
[null,null,"Y",null,"Model number (if known)"]
[null,null,"Y",null,"Maintenance procedure and performance standards","As specified by AS/NZS 2293 Part 2:1995.\n"]
[null,null,"Y",null,"Inspections","Frequency","Maintained or inspected by"]
[null,null,"Y",null,null,"Daily"]
[null,null,"Y",null,null,"Weekly"]
[null,null,"Y",null,null,"Monthly"]
[null,null,"Y",null,null,"3 Monthly"]
[null,null,"Y",null,null,"6 Monthly","Independent qualified person"]
[null,null,"Y",null,null,"Yearly","Independent qualified person"]
[null,null,"Y"]
["SPEC4B","4b: Photo-luminescent emergency lighting",null,null,"Specified System 4","Emergency lighting systems"]
[null,null,{"$f":"$C$337","v":0},null,"Modified by"]
[null,null,0,null,"Description and type","Photo-luminescent emergency lighting system "]
[null,null,0,null,"Location"]
[null,null,0,null,"Make (if known)"]
[null,null,0,null,"Model number (if known)"]
[null,null,0,null,"Maintenance procedure and performance standards","All products are still configured as at installation and there is no material damage to any of these products.\nAll products are clean from general dust build up and any other specific obscuring deposits.\nAll products are clearly visible and have not been covered up by carpet or other materials.\nAll products mark a clear path and have not been obstructed by physical hazards such as trolleys, machinery, partitions, etc.\nAll products can be used to provide clear escape path marking and there has been no change to the configuration of the building which renders the escape path unusable.\nAll light required to charge the product is operation as designed at installation.\n\n"]
[null,null,0,null,"Inspections","Frequency","Maintained or inspected by"]
[null,null,0,null,null,"Daily"]
[null,null,0,null,null,"Weekly"]
[null,null,0,null,null,"Monthly","Owner"]
[null,null,0,null,null,"3 Monthly"]
[null,null,0,null,null,"6 Monthly","Independent qualified person"]
[null,null,0,null,null,"Yearly","Independent qualified person"]
[null,null,0]
["SPEC4C","4c: Emergency lighting system installed 1971-1995",null,null,"Specified System 4","Emergency lighting systems"]
[null,null,{"$f":"$C$352","v":0},null,"Modified by"]
[null,null,0,null,"Description and type","Emergency lighting system – older systems from 1971"]
[null,null,0,null,"Location"]
[null,null,0,null,"Make (if known)"]
[null,null,0,null,"Model number (if known)"]
[null,null,0,null,"Maintenance procedure and performance standards","As specified by NZS 6742:1971.\n"]
[null,null,0,null,"Inspections","Frequency","Maintained or inspected by"]
[null,null,0,null,null,"Daily"]
[null,null,0,null,null,"Weekly"]
[null,null,0,null,null,"Monthly","Owner"]
[null,null,0,null,null,"3 Monthly"]
[null,null,0,null,null,"6 Monthly"]
[null,null,0,null,null,"Yearly","Independent qualified person"]
[null,null,0]
["SPEC5A","5a: Air pressurisation systems",null,null,"Specified System 5","Escape route pressurisation systems"]
[null,null,{"$f":"$C$367","v":0},null,"Modified by"]
[null,null,0,null,"Description and type","Air pressurisation systems pressurising escape routes and safe paths complying with AS 1851-6:2005"]
[null,null,0,null,"Location"]
[null,null,0,null,"Make (if known)"]
[null,null,0,null,"Model number (if known)"]
[null,null,0,null,"Maintenance procedure and performance standards","As specified by AS 1851-6:2005\n"]
[null,null,0,null,"Inspections","Frequency","Maintained or inspected by"]
[null,null,0,null,null,"Daily"]
[null,null,0,null,null,"Weekly"]
[null,null,0,null,null,"Monthly","Independent qualified person"]
[null,null,0,null,null,"3 Monthly"]
[null,null,0,null,null,"6 Monthly"]
[null,null,0,null,null,"Yearly","Independent qualified person"]
[null,null,0]
["SPEC6A","6a: Riser mains or hydrant systems",null,null,"Specified System 6","Riser mains for use by fire services"]
[null,null,{"$f":"$C$382","v":0},null,"Modified by"]
[null,null,0,null,"Description and type","Riser mains/hydrant systems complying with NZS 4510:2008"]
[null,null,0,null,"Location"]
[null,null,0,null,"Make (if known)"]
[null,null,0,null,"Model number (if known)"]
[null,null,0,null,"Maintenance procedure and performance standards","As specified by NZS 4510:2008\n"]
[null,null,0,null,"Inspections","Frequency","Maintained or inspected by"]
[null,null,0,null,null,"Daily"]
[null,null,0,null,null,"Weekly"]
[null,null,0,null,null,"Monthly","Independent qualified person"]
[null,null,0,null,null,"3 Monthly"]
[null,null,0,null,null,"6 Monthly"]
[null,null,0,null,null,"Yearly","Independent qualified person"]
[null,null,0]
["SPEC7A","7a: Automatic backflow preventers","Y",null,"Specified System 7","Automatic backflow preventers connected to a potable water supply"]
[null,null,{"$f":"$C$397","v":"Y"},null,"Modified by","New"]
[null,null,"Y",null,"Description and type","Automatic backflow preventer connected to potable water supply complying with AS 2845:1998 Part 3"]
[null,null,"Y",null,"Location"]
[null,null,"Y",null,"Make (if known)","Wilkins "]
[null,null,"Y",null,"Model number (if known)","Double check valve 950XLT series 20-50mm"]
[null,null,"Y",null,"Maintenance procedure and performance standards","As specified by AS 2845:1998 Part 3\n"]
[null,null,"Y",null,"Inspections","Frequency","Maintained or inspected by"]
[null,null,"Y",null,null,"Daily"]
[null,null,"Y",null,null,"Weekly"]
[null,null,"Y",null,null,"Monthly"]
[null,null,"Y",null,null,"3 Monthly"]
[null,null,"Y",null,null,"6 Monthly"]
[null,null,"Y",null,null,"Yearly","Independent qualified person"]
[null,null,"Y"]
["SPEC8A","8a: Passenger lifts",null,null,"Specified System 8/1","Lift, escalator, travelator, or other systems for moving people or goods within buildings"]
[null,null,{"$f":"$C$412","v":0},null,"Modified by"]
[null,null,0,null,"Description and type","Lifts – passenger carrying, complying with NZS 4332:1997 or BSEN 81.2:2006 as modified by D2/AS1"]
[null,null,0,null,"Location"]
[null,null,0,null,"Make (if known)"]
[null,null,0,null,"Model number (if known)"]
[null,null,0,null,"Maintenance procedure and performance standards","As specified by NZS 4332:1997 or BSEN 81.2:2006\n"]
[null,null,0,null,"Inspections","Frequency","Maintained or inspected by"]
[null,null,0,null,null,"Daily"]
[null,null,0,null,null,"Weekly"]
[null,null,0,null,null,"Monthly","Independent qualified person"]
[null,null,0,null,null,"3 Monthly"]
[null,null,0,null,null,"6 Monthly"]
[null,null,0,null,null,"Yearly","Independent qualified person"]
[null,null,0]
["SPEC8B","8b: Passenger lifts travelling > 10 metres",null,null,"Specified System 8/1","Lift, escalator, travelator, or other systems for moving people or goods within buildings"]
[null,null,{"$f":"$C$427","v":0},null,"Modified by"]
[null,null,0,null,"Description and type","Lifts – passenger carrying, complying with NZS 4332:1997 or BSEN 81.2:2006 as modified by D2/AS1 and C/AS2 – C/AS6 for lifts with travel over 10 metres (installed from 9 April 2012) including Fire Service lift control"]
[null,null,0,null,"Location"]
[null,null,0,null,"Make (if known)"]
[null,null,0,null,"Model number (if known)"]
[null,null,0,null,"Maintenance procedure and performance standards","As specified by NZS 4332:1997 or BSEN 81.2:2006\n"]
[null,null,0,null,"Inspections","Frequency","Maintained or inspected by"]
[null,null,0,null,null,"Daily"]
[null,null,0,null,null,"Weekly"]
[null,null,0,null,null,"Monthly","Independent qualified person"]
[null,null,0,null,null,"3 Monthly"]
[null,null,0,null,null,"6 Monthly"]
[null,null,0,null,null,"Yearly","Independent qualified person"]
[null,null,0]
["SPEC8C","8c: Service lifts",null,null,"Specified System 8/2","Lift, escalator, travelator, or other systems for moving people or goods within buildings"]
[null,null,{"$f":"$C$442","v":0},null,"Modified by"]
[null,null,0,null,"Description and type","Lifts – service lifts designed to Power Lifts Rules not exceeding 750 watts (1HP) applicable at time of installation"]
[null,null,0,null,"Location"]
[null,null,0,null,"Make (if known)"]
[null,null,0,null,"Model number (if known)"]
[null,null,0,null,"Maintenance procedure and performance standards","As specified by Power Lifts Rules not exceeding 750 watts (1HP)\n"]
[null,null,0,null,"Inspections","Frequency","Maintained or inspected by"]
[null,null,0,null,null,"Daily"]
[null,null,0,null,null,"Weekly"]
[null,null,0,null,null,"Monthly","Independent qualified person"]
[null,null,0,null,null,"3 Monthly"]
[null,null,0,null,null,"6 Monthly"]
[null,null,0,null,null,"Yearly","Independent qualified person"]
[null,null,0]
["SPEC8D","8d: Escalators and moving walks",null,null,"Specified System 8/3","Lift, escalator, travelator, or other systems for moving people or goods within buildings"]
[null,null,{"$f":"$C$457","v":0},null,"Modified by"]
[null,null,0,null,"Description and type","Escalators and moving walks"]
[null,null,0,null,"Location"]
[null,null,0,null,"Make (if known)"]
[null,null,0,null,"Model number (if known)"]
[null,null,0,null,"Maintenance procedure and performance standards","In accordance with the requirements of the checklist on page 37 of the Ministry of Business, Innovation and Employment  Compliance Schedule Handbook\n"]
[null,null,0,null,"Inspections","Frequency","Maintained or inspected by"]
[null,null,0,null,null,"Daily"]
[null,null,0,null,null,"Weekly"]
[null,null,0,null,null,"Monthly","Independent qualified person"]
[null,null,0,null,null,"3 Monthly"]
[null,null,0,null,null,"6 Monthly"]
[null,null,0,null,null,"Yearly","Independent qualified person"]
[null,null,0]
["SPEC9A","9a: Mechanical ventilation/extraction systems",null,null,"Specified System 9","Mechanical ventilation or air conditioning systems"]
[null,null,{"$f":"$C$472","v":0},null,"Modified by"]
[null,null,0,null,"Description and type","Mechanical ventilation systems or extraction systems complying with G4/AS1 and C/AS1 (2012) and/or C/AS1–C/AS6 to include shut down on fire signal when the building contains a Type 4 or Type 5 smoke detection system."]
[null,null,0,null,"Location"]
[null,null,0,null,"Make (if known)"]
[null,null,0,null,"Model number (if known)"]
[null,null,0,null,"Maintenance procedure and performance standards","As specified by AS/NZS 3666.2:2002 and as required by compliance document G4/AS1 and C/AS1 (2012) and/or C/AS1–C/AS6.\n"]
[null,null,0,null,"Inspections","Frequency","Maintained or inspected by"]
[null,null,0,null,null,"Daily"]
[null,null,0,null,null,"Weekly"]
[null,null,0,null,null,"Monthly","Independent qualified person"]
[null,null,0,null,null,"3 Monthly"]
[null,null,0,null,null,"6 Monthly"]
[null,null,0,null,null,"Yearly","Independent qualified person"]
[null,null,0]
["SPEC9B","9b: Cooling tower connected to HVAC plant",null,null,"Specified System 9","Mechanical ventilation or air conditioning systems"]
[null,null,{"$f":"$C$487","v":0},null,"Modified by"]
[null,null,0,null,"Description and type","Cooling tower connected to HVAC plant"]
[null,null,0,null,"Location"]
[null,null,0,null,"Make (if known)"]
[null,null,0,null,"Model number (if known)"]
[null,null,0,null,"Maintenance procedure and performance standards","Automatic chemical dosing\nLegionella – AS/NZS 3896\nHeterotrophic micro-organisms – AS 4276.3.1\nManual chemical dosing\nHeterotrophic micro-organisms\nIndependent qualified person tests to AS/NZS 3896 and AS 4276.3.1 shall be undertaken by an IANZ biologically accredited laboratory.\n\n"]
[null,null,0,null,"Inspections","Frequency","Maintained or inspected by"]
[null,null,0,null,null,"Daily"]
[null,null,0,null,null,"Weekly"]
[null,null,0,null,null,"Monthly","Independent qualified person"]
[null,null,0,null,null,"3 Monthly"]
[null,null,0,null,null,"6 Monthly"]
[null,null,0,null,null,"Yearly","Independent qualified person"]
[null,null,0]
["SPEC9C","9c: CO detection in basement car park",null,null,"Specified System 9","Mechanical ventilation or air conditioning systems"]
[null,null,{"$f":"$C$502","v":0},null,"Modified by"]
[null,null,0,null,"Description and type","CO detection in basement car park with extraction system"]
[null,null,0,null,"Location"]
[null,null,0,null,"Make (if known)"]
[null,null,0,null,"Model number (if known)"]
[null,null,0,null,"Maintenance procedure and performance standards","As per AS 1668.2 Supplement 1-2002\n\n"]
[null,null,0,null,"Inspections","Frequency","Maintained or inspected by"]
[null,null,0,null,null,"Daily"]
[null,null,0,null,null,"Weekly"]
[null,null,0,null,null,"Monthly","Independent qualified person"]
[null,null,0,null,null,"3 Monthly"]
[null,null,0,null,null,"6 Monthly"]
[null,null,0,null,null,"Yearly","Independent qualified person"]
[null,null,0]
["SPEC10A","10a: Building maintenance units",null,null,"Specified System 10","Building maintenance units providing access to exterior and interior walls of buildings"]
[null,null,{"$f":"$C$517","v":0},null,"Modified by"]
[null,null,0,null,"Description and type","Building maintenance units"]
[null,null,0,null,"Location"]
[null,null,0,null,"Make (if known)"]
[null,null,0,null,"Model number (if known)"]
[null,null,0,null,"Maintenance procedure and performance standards","As per BS 6037:1981 Clause 21\n\n"]
[null,null,0,null,"Inspections","Frequency","Maintained or inspected by"]
[null,null,0,null,null,"Daily"]
[null,null,0,null,null,"Weekly"]
[null,null,0,null,null,"Monthly"]
[null,null,0,null,null,"3 Monthly","Owner"]
[null,null,0,null,null,"6 Monthly","Independent qualified person"]
[null,null,0,null,null,"Yearly"]
[null,null,0]
["SPEC11A","11a: Laboratory fume cupboards",null,null,"Specified System 11","Laboratory fume cupboards"]
[null,null,{"$f":"$C$532","v":0},null,"Modified by"]
[null,null,0,null,"Description and type","Laboratory fume cupboards"]
[null,null,0,null,"Location"]
[null,null,0,null,"Make (if known)"]
[null,null,0,null,"Model number (if known)"]
[null,null,0,null,"Maintenance procedure and performance standards","As specified by AS/NZS 2243.8:2006\n\n"]
[null,null,0,null,"Inspections","Frequency","Maintained or inspected by"]
[null,null,0,null,null,"Daily"]
[null,null,0,null,null,"Weekly"]
[null,null,0,null,null,"Monthly","Independent qualified person"]
[null,null,0,null,null,"3 Monthly"]
[null,null,0,null,null,"6 Monthly"]
[null,null,0,null,null,"Yearly","Independent qualified person"]
[null,null,0]
["SPEC12A","12a: Audio loops and assistive listening systems",null,null,"Specified System 12","Audio loops or other assistive listening systems"]
[null,null,{"$f":"$C$547","v":0},null,"Modified by"]
[null,null,0,null,"Description and type","Audio loops or other assistive listening systems: FM radio or infrared beam transmission system"]
[null,null,0,null,"Location"]
[null,null,0,null,"Make (if known)"]
[null,null,0,null,"Model number (if known)"]
[null,null,0,null,"Maintenance procedure and performance standards","As referenced by Ministry of Business, Innovation and Employment  Compliance Schedule Handbook\n\n"]
[null,null,0,null,"Inspections","Frequency","Maintained or inspected by"]
[null,null,0,null,null,"Daily"]
[null,null,0,null,null,"Weekly"]
[null,null,0,null,null,"Monthly"]
[null,null,0,null,null,"3 Monthly"]
[null,null,0,null,null,"6 Monthly","Independent qualified person"]
[null,null,0,null,null,"Yearly","Independent qualified person"]
[null,null,0]
["SPEC13A","13a: Mechanical smoke control",null,null,"Specified System 13/1","Smoke control systems"]
[null,null,{"$f":"$C$562","v":0},null,"Modified by"]
[null,null,0,null,"Description and type","Mechanical smoke control complying with AS 1851:2005"]
[null,null,0,null,"Location"]
[null,null,0,null,"Make (if known)"]
[null,null,0,null,"Model number (if known)"]
[null,null,0,null,"Maintenance procedure and performance standards","As specified by AS 1851:2005 and AS/NZS 3666.2:2002\n\n"]
[null,null,0,null,"Inspections","Frequency","Maintained or inspected by"]
[null,null,0,null,null,"Daily"]
[null,null,0,null,null,"Weekly"]
[null,null,0,null,null,"Monthly","Independent qualified person"]
[null,null,0,null,null,"3 Monthly"]
[null,null,0,null,null,"6 Monthly"]
[null,null,0,null,null,"Yearly","Independent qualified person"]
[null,null,0]
["SPEC13B","13b: Natural smoke control",null,null,"Specified System 13/2","Smoke control systems"]
[null,null,{"$f":"$C$577","v":0},null,"Modified by"]
[null,null,0,null,"Description and type","Natural smoke control"]
[null,null,0,null,"Location"]
[null,null,0,null,"Make (if known)"]
[null,null,0,null,"Model number (if known)"]
[null,null,0,null,"Maintenance procedure and performance standards","As specified by AS 1851:2005, AS/NZS 3666.2:2002 and C/AS1 (2012)\n\n"]
[null,null,0,null,"Inspections","Frequency","Maintained or inspected by"]
[null,null,0,null,null,"Daily"]
[null,null,0,null,null,"Weekly"]
[null,null,0,null,null,"Monthly","Owner"]
[null,null,0,null,null,"3 Monthly"]
[null,null,0,null,null,"6 Monthly","Independent qualified person"]
[null,null,0,null,null,"Yearly","Independent qualified person"]
[null,null,0]
["SPEC13C","13c: Smoke curtains",null,null,"Specified System 13/3","Smoke control systems"]
[null,null,{"$f":"$C$592","v":0},null,"Modified by"]
[null,null,0,null,"Description and type","Smoke curtains complying with AS 1851:2005"]
[null,null,0,null,"Location"]
[null,null,0,null,"Make (if known)"]
[null,null,0,null,"Model number (if known)"]
[null,null,0,null,"Maintenance procedure and performance standards","As specified by AS 1851:2005 and NZS 4512:2010\n\n"]
[null,null,0,null,"Inspections","Frequency","Maintained or inspected by"]
[null,null,0,null,null,"Daily"]
[null,null,0,null,null,"Weekly"]
[null,null,0,null,null,"Monthly","Independent qualified person"]
[null,null,0,null,null,"3 Monthly"]
[null,null,0,null,null,"6 Monthly"]
[null,null,0,null,null,"Yearly","Independent qualified person"]
[null,null,0]
["SPEC14A","14a: Emergency power for specified systems 1-13",null,null,"Specified System 14/1","Emergency power systems"]
[null,null,{"$f":"$C$607","v":0},null,"Modified by"]
[null,null,0,null,"Description and type","Emergency power systems for any specified system listed on this compliance schedule"]
[null,null,0,null,"Location"]
[null,null,0,null,"Make (if known)"]
[null,null,0,null,"Model number (if known)"]
[null,null,0,null,"Maintenance procedure and performance standards","As specified by NZS 6104:1981\n\n"]
[null,null,0,null,"Inspections","Frequency","Maintained or inspected by"]
[null,null,0,null,null,"Daily"]
[null,null,0,null,null,"Weekly"]
[null,null,0,null,null,"Monthly","Independent qualified person"]
[null,null,0,null,null,"3 Monthly"]
[null,null,0,null,null,"6 Monthly"]
[null,null,0,null,null,"Yearly","Independent qualified person"]
[null,null,0]
["SPEC14B","14b: Signs relating to specified systems 1-13",null,null,"Specified System 14/2","Signs relating to, a system or feature specified in any Specified Systems 1 to 13"]
[null,null,{"$f":"$C$622","v":0},null,"Modified by"]
[null,null,0,null,"Description and type","Signs relating to a system or feature listed on this compliance schedule"]
[null,null,0,null,"Location"]
[null,null,0,null,"Make (if known)"]
[null,null,0,null,"Model number (if known)"]
[null,null,0,null,"Maintenance procedure and performance standards","All signs are to be clearly visible and unobstructed.\nSigns shall be refurbished before they become illegible, and shall be replaced immediately should they be missing.\n\n"]
[null,null,0,null,"Inspections","Frequency","Maintained or inspected by"]
[null,null,0,null,null,"As per the frequency of the Specified System they are attached to","Owner or Independent qualified person dependent on the Specified System they are attached to."]
[null,null,0,null,null,"Daily"]
[null,null,0,null,null,"Weekly"]
[null,null,0,null,null,"Monthly","Independent qualified person"]
[null,null,0,null,null,"3 Monthly"]
[null,null,0,null,null,"6 Monthly"]
[null,null,0,null,null,"Yearly","Independent qualified person"]
[null,null,0]
["SPEC15A","15a: Spoken communication systems for evacuation",null,null,"Specified System 15/1","Systems for communicating spoken information intended to facilitate evacuation"]
[null,null,{"$f":"$C$638","v":0},null,"Modified by"]
[null,null,0,null,"Description and type","Emergency warning intercommunications system"]
[null,null,0,null,"Location"]
[null,null,0,null,"Make (if known)"]
[null,null,0,null,"Model number (if known)"]
[null,null,0,null,"Maintenance procedure and performance standards","AS 1670.4:2004 or AS 1851: Section 10:2005\nAnd as applicable to NZS 4512:2003\n\n\n"]
[null,null,0,null,"Inspections","Frequency","Maintained or inspected by"]
[null,null,0,null,null,"Daily"]
[null,null,0,null,null,"Weekly"]
[null,null,0,null,null,"Monthly","Independent qualified person"]
[null,null,0,null,null,"3 Monthly"]
[null,null,0,null,null,"6 Monthly"]
[null,null,0,null,null,"Yearly","Independent qualified person"]
[null,null,0]
["SPEC15B","15b: Final exit doors","Y",null,"Specified System 15/2","Final exits"]
[null,null,{"$f":"$C$653","v":"Y"},null,"Modified by","New and existing"]
[null,null,"Y",null,"Description and type","Final exit doors and other exit doors"]
[null,null,"Y",null,"Location"]
[null,null,"Y",null,"Make (if known)"]
[null,null,"Y",null,"Model number (if known)"]
[null,null,"Y",null,"Maintenance procedure and performance standards","Visual inspection to ensure all the means of escape are in good repair and in accordance with compliance document C/AS1–C/AS7.\n\n\n"]
[null,null,"Y",null,"Inspections","Frequency","Maintained or inspected by"]
[null,null,"Y",null,null,"Daily","Owner (Crowd groups)"]
[null,null,"Y",null,null,"Weekly"]
[null,null,"Y",null,null,"Monthly","Owner (Other occupancies)"]
[null,null,"Y",null,null,"3 Monthly"]
[null,null,"Y",null,null,"6 Monthly"]
[null,null,"Y",null,null,"Yearly","Independent qualified person"]
[null,null,"Y"]
["SPEC15C","15c: Fire separations protecting a means of escape",null,null,"Specified System 15/3","Fire separations"]
[null,null,{"$f":"$C$668","v":0},null,"Modified by"]
[null,null,0,null,"Description and type","Fire separations protecting a means of escape"]
[null,null,0,null,"Location"]
[null,null,0,null,"Make (if known)"]
[null,null,0,null,"Model number (if known)"]
[null,null,0,null,"Maintenance procedure and performance standards","Visual inspection of fire partitions including doors and their proper operation and in accordance with compliance document C/AS1 (2012) and C/AS1–C/AS7, or NZS 1900 for buildings built and as altered prior to the introduction of the Building Act.\n\n\n"]
[null,null,0,null,"Inspections","Frequency","Maintained or inspected by"]
[null,null,0,null,null,"Daily"]
[null,null,0,null,null,"Weekly"]
[null,null,0,null,null,"Monthly","Owner"]
[null,null,0,null,null,"3 Monthly"]
[null,null,0,null,null,"6 Monthly"]
[null,null,0,null,null,"Yearly","Independent qualified person"]
[null,null,0]
["SPEC15D","15d: Signs communicating evacuation information","Y",null,"Specified System 15/4","Signs for communicating information intended to facilitate evacuation"]
[null,null,{"$f":"$C$683","v":"Y"},null,"Modified by","New, existing and altered"]
[null,null,"Y",null,"Description and type","Exit and other signs for communicating information intended to facilitate evacuation"]
[null,null,"Y",null,"Location","Exit signage - throughout the escape routes and at the final exits\nStorage limitation signage (3m max.) - areas as per fire design report"]
[null,null,"Y",null,"Make (if known)"]
[null,null,"Y",null,"Model number (if known)"]
[null,null,"Y",null,"Maintenance procedure and performance standards","All signs are to be clearly visible and unobstructed.\nSigns shall be refurbished before they become illegible, and shall be replaced immediately should they be missing.\nDefects in illuminated signs shall be replaced immediately they are apparent.\nAnd in accordance with compliance document F8/AS1.\n\n\n\n"]
[null,null,"Y",null,"Inspections","Frequency","Maintained or inspected by"]
[null,null,"Y",null,null,"Daily"]
[null,null,"Y",null,null,"Weekly"]
[null,null,"Y",null,null,"Monthly","Owner"]
[null,null,"Y",null,null,"3 Monthly"]
[null,null,"Y",null,null,"6 Monthly"]
[null,null,"Y",null,null,"Yearly","Independent qualified person"]
[null,null,"Y"]
["SPEC15E","15e: Smoke separations",null,null,"Specified System 15/5","Smoke separations"]
[null,null,{"$f":"$C$698","v":0},null,"Modified by"]
[null,null,0,null,"Description and type","Exit and other signs for communicating information intended to facilitate evacuation"]
[null,null,0,null,"Location"]
[null,null,0,null,"Make (if known)"]
[null,null,0,null,"Model number (if known)"]
[null,null,0,null,"Maintenance procedure and performance standards","Smoke separations shall be maintained at all times in a safe condition with particular attention to proper operation of smoke control doors and in accordance with compliance document C/AS1 (2012) and C/AS1– C/AS7, or NZS 1900 for buildings built and as altered prior to the introduction of the Building Act.\n\n\n\n"]
[null,null,0,null,"Inspections","Frequency","Maintained or inspected by"]
[null,null,0,null,null,"Daily"]
[null,null,0,null,null,"Weekly"]
[null,null,0,null,null,"Monthly","Owner"]
[null,null,0,null,null,"3 Monthly"]
[null,null,0,null,null,"6 Monthly"]
[null,null,0,null,null,"Yearly","Independent qualified person"]
[null,null,0]
["SPEC16A","16a: Cable car attached to or servicing a building",null,null,"Specified System 16","Cable car attached to or servicing a building"]
[null,null,{"$f":"$C$713","v":0},null,"Modified by"]
[null,null,0,null,"Description and type","Cable car"]
[null,null,0,null,"Location"]
[null,null,0,null,"Make (if known)"]
[null,null,0,null,"Model number (if known)"]
[null,null,0,null,"Maintenance procedure and performance standards","Planned preventative maintenance and responsive maintenance should be done according to the nominated performance and inspection standard or document, and must ensure the system will always operate safely.\nRefer to NZS 5270 Appendix A–D for specifically designed solution by a suitably qualified person for monthly owner inspections.\n\n\n\n"]
[null,null,0,null,"Inspections","Frequency","Maintained or inspected by"]
[null,null,0,null,null,"Daily"]
[null,null,0,null,null,"Weekly"]
[null,null,0,null,null,"Monthly","Owner"]
[null,null,0,null,null,"3 Monthly"]
[null,null,0,null,null,"6 Monthly"]
[null,null,0,null,null,"Yearly","Independent qualified person"]
[null,null,0]
["SPECB","Specified system B",null,null,"Specified System"]
[null,null,{"$f":"$C$728","v":0},null,"Modified by"]
[null,null,0,null,"Description and type"]
[null,null,0,null,"Location"]
[null,null,0,null,"Make (if known)"]
[null,null,0,null,"Model number (if known)"]
[null,null,0,null,"Maintenance procedure and performance standards"]
[null,null,0,null,"Inspections","Frequency","Maintained or inspected by"]
[null,null,0,null,null,"Daily"]
[null,null,0,null,null,"Weekly"]
[null,null,0,null,null,"Monthly","Owner"]
[null,null,0,null,null,"3 Monthly"]
[null,null,0,null,null,"6 Monthly"]
[null,null,0,null,null,"Yearly","Independent qualified person"]
["SPECB","Specified system B",null,null,"Specified System"]
[null,null,{"$f":"$C$742","v":0},null,"Modified by"]
[null,null,0,null,"Description and type"]
[null,null,0,null,"Location"]
[null,null,0,null,"Make (if known)"]
[null,null,0,null,"Model number (if known)"]
[null,null,0,null,"Maintenance procedure and performance standards"]
[null,null,0,null,"Inspections","Frequency","Maintained or inspected by"]
[null,null,0,null,null,"Daily"]
[null,null,0,null,null,"Weekly"]
[null,null,0,null,null,"Monthly","Owner"]
[null,null,0,null,null,"3 Monthly"]
[null,null,0,null,null,"6 Monthly"]
[null,null,0,null,null,"Yearly","Independent qualified person"]
["SPECB","Specified system B",null,null,"Specified System"]
[null,null,{"$f":"$C$756","v":0},null,"Modified by"]
[null,null,0,null,"Description and type"]
[null,null,0,null,"Location"]
[null,null,0,null,"Make (if known)"]
[null,null,0,null,"Model number (if known)"]
[null,null,0,null,"Maintenance procedure and performance standards"]
[null,null,0,null,"Inspections","Frequency","Maintained or inspected by"]
[null,null,0,null,null,"Daily"]
[null,null,0,null,null,"Weekly"]
[null,null,0,null,null,"Monthly","Owner"]
[null,null,0,null,null,"3 Monthly"]
[null,null,0,null,null,"6 Monthly"]
[null,null,0,null,null,"Yearly","Independent qualified person"]

{"sheet":"B151a-Fire safety specialist","index":7,"n_rows":73,"n_cols":26,"rows_kept":73,"cut":false,"hidden":false,"merged":[[7,8,7,9],[3,1,3,6],[10,1,10,6],[9,4,9,6],[8,4,8,6],[7,4,7,6],[9,1,9,3],[7,1,7,3],[8,1,8,3],[4,1,4,6],[6,4,6,6],[5,4,5,6],[71,1,71,2],[5,1,5,3],[6,1,6,3],[16,1,16,2],[65,1,65,2],[26,1,26,2],[39,1,39,2],[11,1,11,6],[57,1,57,2],[13,1,13,2]]}
[null,null,null,null,null,null,null,null,"Summary sheet","B501-Not accepted letter"]
[null,"B-151a LU: 15.06.16 LR: 15.06.16 v10",null,null,null,null,null,null,"Vetting sheet","B501a-Not accepted with invoice"]
[null,null,null,null,null,null,null,null,"B120-Processing sheet","Application update letter"]
[null,{"$f":"IF(Z4=\"N/A\",\"                  SPECIALIST REVIEW ON THIS PROCESSING SHEET IS NOT APPLICABLE TO THIS APPLICATION\",\"\")","v":""},null,null,null,null,null,null,"B150-Structural specialist","B521-RFI letter",null,null,null,null,null,null,null,null,null,null,null,null,null,null,{"$f":"IF(Z4=\"N/A\",TRUE,FALSE)","v":false},{"$f":"'Summary sheet'!C42","v":"Yes"}]
[null,"Form B-151a                                                                    SPECIALIST FIRE SAFETY PROCESSING SHEET",null,null,null,null,null,null,"B151a-Fire safety specialist","B529-Final reminder letter"]
[null,"Building consent number (BCN):   ","Building consent number (BCN):   ","Building consent number (BCN):   ",{"$f":"'Summary sheet'!E15","v":"BCN/2017/2013"},null,null,null,"B151b-Fire safety specialist","B532-Refusal letter",null,"Y"]
[null,"Project address:   ","Project address:   ","Project address:   ",{"$f":"'Summary sheet'!E16","v":"80 Byron Street Sydenham "},null,null,null,"B160-PS specialist","S71-74 natural hazards",null,"N/A"]
[null,"Description of building work:","Project description:","Project description:",{"$f":"'Summary sheet'!E17","v":"Addition to Factory - New Offices, Meeting and Store Room"},null,null,null,"B462-Draft CS",null,null,"RFI"]
[null,"Building level:        ","Building level:        ","Building level:        ",{"$f":"'Summary sheet'!E18","v":"Commercial 1"}]
[null,"Classified use(s):  ","Classified use(s):  ","Classified use(s):  ",{"$f":"'Summary sheet'!E19","v":"Commercial"}]
[]
[null,"Key for abbreviations to answering processing questions\nY - The application satisfies the intent of the question. Provide comment if appropriate\nN/a - The question is not applicable to this application. Provide comment if appropriate\nRFI - The application has not meet the intent of this question and a request for information is required. Write request in RFI cell for inclusion in RFI letter. The application must not be granted until all RFIs are resolved and the answer has been changed to Yes or N/a\nUse Resolved or Not resolved in the far right column to indicate status of RFI item after receiving a response to the RFI item. This will appear on any further RFI letters"]
[null,null,"Questions to be answered\nAlso refer to inserted comments","(Y, N/a RFI)","Comments","RFI","RFI Resolved",null,null,null,null,"Not Resolved","Resolved"]
[null,"FIRE SAFETY – APPLICATION DOCUMENTATION:",null,null,null,null,null,null,null,null,null,"The specialist fire safety reviewer of this application requires "]
[null,1,"Has a fire safety design summary been provided?\nConsider if the size or complexity of the design justifies  the designer also providing a coordination statement","Y","cosgroves. Fire report covers existing building which states as a workshop for clipnclimb. Notingloading dock. Also check existing CS . Loading dock VP workshop with storage up to 3.0m is WB. Purpose Group WM as WL does not allow any storage. So could be considered a change of use. need existing CS> ",null,null,null,null,null,{"$f":"(IF(F15=\"\",\"\",2))","v":""},"The performance required by this item is not applicable to the building work included in this application",null,null,null,null,null,null,null,null,{"$f":"IF(D15=\"RFI\",1,(IF(G15=\"NOT RESOLVED\",1,\"\")))","v":""}]
[null,2,"Has the applicant confirmed construction monitoring of fire safety features?","N/A",null,null,null,null,null,null,"","This item is not applicable because the existing building's compliance is unchanged the building work included in this application",null,null,null,null,null,null,null,null,""]
[null,"BUILDING ACT:  "]
[null,3,"Is the fire safety design for a new building?\nIncludes first fit-outs of new buildings","Y","new and extension. But chceking the change of use. ",null,null,null,null,null,"","Complies with the acceptable solution",null,null,null,null,null,null,null,null,""]
[null,4,"S112 - Is the fire safety design for an alteration to an existing building?\nWhere a building score sheet from MBIE guidance 'Requesting information about means of escape from fire for existing buildings' has been provided as supporting information, check if the score has been correctly calculated","Y",null,null,null,null,null,null,"","Complies by specific engineering design",null,null,null,null,null,null,null,null,""]
[null,5,"S115 - Will the building under go a change of use?\nWhere a building score sheet from MBIE guidance 'Requesting information about means of escape from fire for existing buildings' has been provided as supporting information, check if the score has been correctly calculated","N/A","new and extension. But chceking the change of use. WL FHC 2 with spks noted in part. Only one CS for the building therefore as it stands the current fire rpeort does not address the current CS . As this needs to be reissued . We need to know if the spks are still in the building. / neighbour. \nresponse =>\n\nReviewer Note: There is no existing Compliance Schedule. Unclear where initial reviewer is referring with respect to any existing Compliance Shcedule.  RFI is withdrawn.  A new compliance shcedule will be drafted. No Change of Use evident","The existing use listed on the compliance schedule is WL FHC2 and the building in part is provided with sprinkler coverage. Please reassess the building and update the fire report to reflect the change of use occuring and specified systems within the building. We cannot amend the compliance schedule without further information provided on the sprinkler system. \nADDED 13/7/2017 - Response noted.  As previously advised the existing Compliance Schedule (CS) states the building Purpose Group as WL, and that the building has some form of sprinkler protection.  The fire design proposes the building is to be used for workshop with storage to 3m which would change the use to WM Purpose Group. Consideration of such a Change of Use, and any building deletion of sprinklers from the CS and it's impact on neighbouring property protection as applicable is required.","Resolved",null,null,null,2,"The submitted fire design summary not does contain enough information to review the fire safety aspect of this building consent application. Please note that Section 112/115 of the Building Act requires the whole building to be assessed.",null,null,null,null,null,null,null,null,""]
[null,6,"S116A - Has consideration been given to the likelihood of issues from future subdivision?","N/A",null,null,null,null,null,null,"","The fire safety report states the fire safety design requirements to comply with the Building Code but does not indicate that these requirements have been coordinated with the building consent documentation. If these requirements are not coordinated  into the building consent documentation it is likely they will not be included in the finished building work. Please supply a design coordination statement from your  fire designer/design team, as outlined in IPENZ's Practice Note 22, The design statement advises that the fire safety design requirements have been coordinated with and accurately transferred to the drawings, specifications and documents prepared by these other disciplines.   \n      ",null,null,null,null,null,null,null,null,""]
[null,7,"S67 - Has the applicant requested a waiver or modification of the building code?\nThe conditions for a waiver or modification of performances relating to external fire spread and received radiation will require a legal agreement to be arranged","N/A",null,null,null,null,null,null,{"$f":"(IF(F22=\"\",\"\",2))","v":""},"The fire safety design submitted with the building consent application does not contain enough information to establish that the fire safety design the fire safety design will comply with the NZ building code. Please refer to IPENZ's Practice Note 22 for the information your fire safety design should contain. ",null,null,null,null,null,null,null,null,{"$f":"IF(D22=\"RFI\",1,(IF(G22=\"NOT RESOLVED\",1,\"\")))","v":""}]
[null,8,"S75 - Does the appication involve construction of building on 2 or more allotments?","N/A",null,null,null,null,null,null,"","We believe it is more appropriate for your fire designer to carry out the construction monitoring and provide a PS4 for fire safety at the completion of this project. The level of construction monitoring we consider appropriate is to at least CM2 level. Please confirm this is to be arranged.",null,null,null,null,null,null,null,null,""]
[null,9,"S46 - Is the application of a type that a copy must be provided to NZFS Commission?","Y",null,null,null,null,null,null,"","Please clarify whether there is intentions to subdivide/unit-title/cross-lease the proposed building.",null,null,null,null,null,null,null,null,""]
[null,10,"S48 (3) - Has regard been given to the memorandum provided by the NZ Fire Service Commission?","Y","\n\n$603.75 INC GST \nresponses - #\nBelow#is#my#suggested#response#to#NZFS.\n#\n1.1 Please#refer#aIached#photo#for#the#opening#between#two#spaces#and#there#is#no#sliding#door.\n#\n1.2 a:#The#external#fire#rated#wall#is#of#concrete#construc9on#and#the#structural#engineer’s#design\ncalcula9on#should#provide#informa9on#on#achieving#the#required#fire#ra9ng#and#meet#with#postO\nfire#structural#stability#requirements.\n#\nb:#The#coordina9on#of#the#fire#safety#requirements#between#the#fire#design#and#architectural#&\nstructural#engineer#has#occurred.","As this application meets the criteria in NEW ZEALAND GAZETTE, No. 49  under 'Notice that Copies of Certain Applications for Building Consent Must be Provided to the New Zealand Fire Service Commission', the application has been sent to NZFS for them to provide a memorandum in accordance with section 47 of the Building Act. Once we receive their memorandum we will give regard to the memorandum and send to you for your response.\nADDED 21/04/2017 Please address the issues raised in the attached memo from the NZFS. \nADDED 13/7/2017 - Response to NZFS DRU memo, issued 21/4/2017, is still awaited. Memo is re-attached for use.","Resolved",null,null,null,2,"As this application meets the criteria in NEW ZEALAND GAZETTE, No. 49  under 'Notice that Copies of Certain Applications for Building Consent Must be Provided to the New Zealand Fire Service Commission', the application has been sent to NZFS for them to provide a memorandum in accordance with section 47 of the Building Act. Once we receive their memorandum we will give regard to the memorandum and send to you for your response.",null,null,null,null,null,null,null,null,""]
[null,11,"S363A - Has consideration been given to the likelihood of issues from public use of the premises before CCC is issued?","N/A",null,null,null,null,null,null,"","Please clarify whether there is intentions for members of the public to occupy the building or part of the building before  code compliance certificate is issued for this building consent. If there is intention to do so, you will need to apply for a Certificate of Public Use before members of the public occupy the  occupying the building after receiving the building consent. Please provide the fire safety management plan which shows how members of the public will be safe.",null,null,null,null,null,null,null,null,""]
[null,"DESIGN USING VM2 OR ALTERNATIVE SOLUTION:",null,null,null,null,null,null,null,null,null,"Please supply a design coordination statement from your  fire designer/design team, as outlined in IPENZ's Practice Note 22, The design statement advises that the fire safety design requirements have been coordinated with and accurately transferred to the drawings, specifications and documents prepared by these other disciplines.  ",null,null,null,null,null,null,null,null,null,null,null,true]
[null,12,"Does the design comply fully with C/VM2?",null,null,null,null,null,null,null,"","Please provide confirmation from the peer reviewer that the design has been coordinated. Please provide a list of documents reviewed including the revision number/date.",null,null,null,null,null,null,null,null,""]
[null,13,"Has the Fire Engineering Brief been agreed to by the stakeholders (peer reviewer, NZFS and Council)?",null,null,null,null,null,null,null,"","Please provide an emergency lighting design to demonstrate compliance with F6 of NZ Building Code. Please refer to paragraph 1.7 of F6/AS1 for the documentation you need to supply. Please provide full technical justification of the design and a PS1 from a CPEng engineer with assessed area being electrical engineering, or from a professional lighting consultant. ",null,null,null,null,null,null,null,null,""]
[null,14,"Is the designer CPEng with assessed area being Fire Engineering? Is the designer practising in their area of expertise?",null,null,null,null,null,null,null,"","Please provide a PS1 for F6 from a CPEng engineer with assessed area being electrical engineering, or from a professional lighting consultant.",null,null,null,null,null,null,null,null,""]
[null,15,"Has the designer provided a PS1 covering C1-C6, F6, F7, F8 (depends on which building code clauses are applicable)?",null,null,null,null,null,null,null,{"$f":"(IF(F31=\"\",\"\",2))","v":""},"We believe it is more appropriate for your emergency lighting designer to carry out the necessary inspections and provide a PS4 for the emergency lighting design at the completion of the project. Please confirm this is to be arranged.",null,null,null,null,null,null,null,null,{"$f":"IF(D31=\"RFI\",1,(IF(G31=\"NOT RESOLVED\",1,\"\")))","v":""}]
[null,16,"Is the peer reviewer CPEng with assessed area being Fire Engineering? Is the peer reviewer practising within their area of expertise?",null,null,null,null,null,null,null,{"$f":"(IF(F32=\"\",\"\",2))","v":""},null,null,null,null,null,null,null,null,null,{"$f":"IF(D32=\"RFI\",1,(IF(G32=\"NOT RESOLVED\",1,\"\")))","v":""}]
[null,17,"Has the peer reviewer provided a PS2 covering C1-C6, F6, F7, F8 (depends on which building code clauses are applicable)?",null,null,null,null,null,null,null,"",null,null,null,null,null,null,null,null,null,""]
[null,18,"Has the fire safety design summary included all the calculations to support the design conclusions? ",null,null,null,null,null,null,null,{"$f":"(IF(F34=\"\",\"\",2))","v":""},null,null,null,null,null,null,null,null,null,{"$f":"IF(D34=\"RFI\",1,(IF(G34=\"NOT RESOLVED\",1,\"\")))","v":""}]
[null,19,"Has the fire safety designer provided a design coordination statement? ",null,null,null,null,null,null,null,"",null,null,null,null,null,null,null,null,null,{"$f":"IF(D35=\"RFI\",1,(IF(G35=\"NOT RESOLVED\",1,\"\")))","v":""}]
[null,20,"Has the peer reviewer confirmed the design has been coordinated?",null,null,null,null,null,null,null,"",null,null,null,null,null,null,null,null,null,{"$f":"IF(D36=\"RFI\",1,(IF(G36=\"NOT RESOLVED\",1,\"\")))","v":""}]
[null,21,"Has the peer reviewer confirmed the requirements of the FEB have been satisfied?",null,null,null,null,null,null,null,"",null,null,null,null,null,null,null,null,null,{"$f":"IF(D37=\"RFI\",1,(IF(G37=\"NOT RESOLVED\",1,\"\")))","v":""}]
[null,22,"Has the peer reviewer confirmed the proposed compliance schedule is correct?",null,null,null,null,null,null,null,"",null,null,null,null,null,null,null,null,null,{"$f":"IF(D38=\"RFI\",1,(IF(G38=\"NOT RESOLVED\",1,\"\")))","v":""}]
[null,23,"Has the peer reviewer provided a list of proposed conditions/advice notes for inclusion with the building consent?",null,null,null,null,null,null,null,"",null,null,null,null,null,null,null,null,null,{"$f":"IF(D39=\"RFI\",1,(IF(G39=\"NOT RESOLVED\",1,\"\")))","v":""}]
[null,"BUILDING CODE USING ACCEPTABLE SOLUTIONS:",null,null,null,null,null,null,null,null,null,null,null,null,null,null,null,null,null,null,null,null,null,false]
[null,24,"Has the correct risk group(s) and associated acceptable solution(s) been used?\nRecord risk group(s) and use(s)","Y","existing Workshop with storage up to 3.0m managed by signage. On Compliance schedule. New offices. Single storet WL. ",null,null,null,null,null,{"$f":"(IF(F41=\"\",\"\",2))","v":""},null,null,null,null,null,null,null,null,null,""]
[null,25,"Has the occupant load been correctly calculated as per the  paragraphs in 1.4?\nRecord the occupant load","Y","100m2/p is for bulk storage including racking in C/AS5. workshops / heavy industry is 5 or 30 m2/p \nresponse - > bulk storage type application","Please provide further justification for the occupant load density for the workshop area and please update the fire report.","Resolved",null,null,null,2,null,null,null,null,null,null,null,null,null,""]
[null,26,"Do any intermediate floors (size, alarm system, fire rating) comply with the   building code (or ANARP for existing)? \nRefer to paragraphs 2.2, 3.3, 3.4, 3.7, 4.13 of relevant C/AS","N/A","removing exising ",null,null,null,null,null,"",null,null,null,null,null,null,null,null,null,""]
[null,27,"Does the provision of firecells, fire safety systems and fire resistance ratings comply with the building code (or ANARP for existing)? \nRefer to part 2 of relevant C/AS","Y","workshop with storage limited to 3.0m and offices. 60 120 mins",null,null,null,null,null,"",null,null,null,null,null,null,null,null,null,""]
[null,28,"Does the number, height, width and length of escape routes comply with the  building code (or ANARP for existing)? \nRefer to paragraphs in 3.2 - 3.4 of C/AS","Y",null,null,null,null,null,null,"",null,null,null,null,null,null,null,null,null,""]
[null,29,"Does the configuration of the internal/external escape routes  comply with the  building code (or ANARP for existing)? \nRefer to paragraphs in 3.5 - 3.14 of C/AS","Y",null,null,null,null,null,null,"",null,null,null,null,null,null,null,null,null,""]
[null,30,"Do lifts and lift landings comply with the building code (or ANARP for existing)? \nRefer to paragraphs 3.10.3, 3.10.4 and 3.10.5 of the relevant C/AS","N/A",null,null,null,null,null,null,"",null,null,null,null,null,null,null,null,null,""]
[null,31,"Do the doors on escape routes comply with the  building code (or ANARP for existing)? \nRefer to paragraphs in 3.15 of the relevant C/AS","Y","key locks to be replaced by snib lock. Check arch. ","The fire report requirements include replacing key locks with snib locks. To demonstrate that the design is coordinated please provide a door hardware schedule as part of the architectural set of drawings. \nADDED 13/7/2017 - Fire engineer response noted.  Please provide the door schedule detailing the required new door locks to be provided for compliance.","Resolved",null,null,null,{"$f":"(IF(F48=\"\",\"\",2))","v":2},null,null,null,null,null,null,null,null,null,{"$f":"IF(D48=\"RFI\",1,(IF(G48=\"NOT RESOLVED\",1,\"\")))","v":""}]
[null,32,"Do the signs on escape routes comply with the  building code (or ANARP for existing)?\nRefer to paragraphs in 3.16 of the relevant C/AS","Y",null,null,null,null,null,null,{"$f":"(IF(F49=\"\",\"\",2))","v":""},null,null,null,null,null,null,null,null,null,{"$f":"IF(D49=\"RFI\",1,(IF(G49=\"NOT RESOLVED\",1,\"\")))","v":""}]
[null,33,"Do the firecells, glazing in fire and smoke separations, structural stability during fire, fire stopping and firecell construction comply with the  building code (or ANARP for existing)?  \nRefer to paragraphs in 4.1 - 4.5 of the relevant C/AS","Y","new concrete block wall on boundary. existing considered under S112 subject to sighting CS. ",null,null,null,null,null,"",null,null,null,null,null,null,null,null,null,""]
[null,34,"Do theatres and tiered seating comply with the building code (or ANARP for existing)?  \nRefer to paragraphs in 4.6  and 4.8 of C/AS4","N/A",null,null,null,null,null,null,"",null,null,null,null,null,null,null,null,null,""]
[null,35,"Do exhibition and retail areas with an occupant load of greater than 500 comply with the building code (or ANARP for existing)?\nRefer to paragraph 4.7 of C/AS4","N/A",null,null,null,null,null,null,"",null,null,null,null,null,null,null,null,null,""]
[null,36,"Do exitways, intermittent activities, protected shafts, long corridor subdivision, floors, subfloor spaces, concealed spaces, and closures in fire and smoke separations comply with the  building code (or ANARP for existing)?\nRefer to paragraphs in 4.9 - 4.16 of the relevant C/AS\nConsider requirements for fire separation to solid waste storage, plant, boiler and incinerator rooms as per paragraphs in 4.10","N/A",null,null,null,null,null,null,"",null,null,null,null,null,null,null,null,null,""]
[null,37,"Do interior surface finishes comply with the building code (or ANARP for existing)? \nRefer to paragraphs in 4.17 of the relevant C/AS","Y","plywood ceiling in group 3 areas. \nResponse noted - plywood is recognised as having GN3 - query resolved","The fire report states that the wall and ceiling linings in the new office extension is painted plasterboard, however it appears that plywood is noted. Please update the fire report / architectural plans as applicable to demonstrate that the design has been coordinated. ","Resolved",null,null,null,2,null,null,null,null,null,null,null,null,null,""]
[null,38,"Does the building services plant comply with the  building code (or ANARP for existing)?\nRefer to paragraphs in 4.18 of the relevant C/AS","N/A",null,null,null,null,null,null,"",null,null,null,null,null,null,null,null,null,""]
[null,39,"Do exterior surface finishes comply with the  building code (or ANARP for existing)?\nRefer to paragraphs in 5.8 of the relevant C/AS","N/A",null,null,null,null,null,null,"",null,null,null,null,null,null,null,null,null,""]
[null,40,"Do the fire fighting features comply with  building code (or ANARP for existing)? \nRefer to paragraphs in 6.1 - 6.4 of the relevant C/AS","Y",null,null,null,null,null,null,"",null,null,null,null,null,null,null,null,null,""]
[null,"OTHER DESIGN CONSIDERATIONS:"]
[null,41,"Does the fire separation for buildings with more than one title comply with the building code (or ANARP when change of use of existing)? \nRefer to paragraphs in 5.1 of the relevant C/AS","N/A",null,null,null,null,null,null,{"$f":"(IF(F59=\"\",\"\",2))","v":""},null,null,null,null,null,null,null,null,null,{"$f":"IF(D59=\"RFI\",1,(IF(G59=\"NOT RESOLVED\",1,\"\")))","v":""}]
[null,42,"Does the control of horizontal fire spread comply with the  building code (or ANARP when change of use of existing)?\nRefer to paragraphs in  5.2 - 5.6 of the relevant C/AS or method from C/VM2","Y",null,null,null,null,null,null,{"$f":"(IF(F60=\"\",\"\",2))","v":""},null,null,null,null,null,null,null,null,null,{"$f":"IF(D60=\"RFI\",1,(IF(G60=\"NOT RESOLVED\",1,\"\")))","v":""}]
[null,43,"Does the control of vertical fire spread comply with building code (or ANARP when change of use of existing)?\nRefer to paragraphs in 5.7 of the relevant C/AS","Y",null,null,null,null,null,null,{"$f":"(IF(F61=\"\",\"\",2))","v":""},null,null,null,null,null,null,null,null,null,{"$f":"IF(D61=\"RFI\",1,(IF(G61=\"NOT RESOLVED\",1,\"\")))","v":""}]
[null,44,"Does the design for  Visibility in Escape Routes (locations and products specified) comply with F6 of the building code  (or ANARP for existing)?","Y","Cosgroves Escape routes >20m","Please provide an emergency lighting design to demonstrate compliance with F6 of NZ Building Code as required in the Fire report. Please refer to paragraph 1.7 of F6/AS1 for the documentation you need to supply. Please provide full technical justification of the design and a PS1 from a CPEng engineer with assessed area being electrical engineering, or from a professional lighting consultant. \nADDED 13/7/2017 - Query outstanding","Resolved",null,null,null,{"$f":"(IF(F62=\"\",\"\",2))","v":2},null,null,null,null,null,null,null,null,null,{"$f":"IF(D62=\"RFI\",1,(IF(G62=\"NOT RESOLVED\",1,\"\")))","v":""}]
[null,45,"Has the emergency lighting designer provided a PS1 covering F6?","Y","As above - Stephen Page CPEng",null,null,null,null,null,{"$f":"(IF(F63=\"\",\"\",2))","v":""},null,null,null,null,null,null,null,null,null,{"$f":"IF(D63=\"RFI\",1,(IF(G63=\"NOT RESOLVED\",1,\"\")))","v":""}]
[null,46,"Has the applicant confirmed the emergency lighting designer will provide a PS4 covering F6?","Y","Confirmed","We believe it is more appropriate for your emergency lighting designer to carry out the necessary inspections and provide a PS4 for the emergency lighting design at the completion of the project. Please confirm this is to be arranged.\nADDED 13/7/2017 - Query outstanding","Resolved",null,null,null,{"$f":"(IF(F64=\"\",\"\",2))","v":2},null,null,null,null,null,null,null,null,null,{"$f":"IF(D64=\"RFI\",1,(IF(G64=\"NOT RESOLVED\",1,\"\")))","v":""}]
[null,47,"Where specific design is required for during and post fire structural stability has the form B-151(b) has been added for structural specialist? \nEmail BCO and Structural Specialist ","N/A",null,null,null,null,null,null,{"$f":"(IF(F65=\"\",\"\",2))","v":""},null,null,null,null,null,null,null,null,null,{"$f":"IF(D65=\"RFI\",1,(IF(G65=\"NOT RESOLVED\",1,\"\")))","v":""}]
[null,"BUILDING CONSENT DOCUMENTATION:"]
[null,48,"Are all the fire safety design features documented in consent documents?","Y",null,null,null,null,null,null,"",null,null,null,null,null,null,null,null,null,""]
[null,49,"Have all the construction documentation and advice notes related to fire safety design been added to allow for inclusion on the B-411? ","Y","EL PS4 Cosgroves\nfirestopping\nSignage",null,null,null,null,null,"",null,null,null,null,null,null,null,null,null,""]
[null,50,"Have all new, altered or existing specified systems details been added to allow for inclusion on the B-462 - draft compliance schedule?\nInclude the details of use(s), occupant numbers and 'highest fire hazard category' ","Y","existing Workshop with storage up to 3.0m managed by signage. On Compliance schedule. ",null,null,null,null,null,"",null,null,null,null,null,null,null,null,null,""]
[null,51,"Have the Council inspections related to fire safety design been added to allow for inclusion on the B-412 - schedule of specified inspections?","Y","Firewall x 2",null,null,null,null,null,"",null,{"$f":"M71&\"  \"&M72&M73&N72","v":"Specialist Review : Fire  (Adrienne Slattery (Jonathan Nyman from 13/7/2017))"},null,null,null,null,null,null,null,""]
[null,52,"Has the approved fire safety design summary been stamped?","Y",null,null,null,null,null,null,"",null,"Specialist Review : Fire",null,null,null,null,null,null,null,""]
[null,"SPECIALIST REVIEW COMPLETED",null,null,null,"Specialist Name ","Status/Date Completed",null,null,null,{"$f":"SUM(K15:K71)","v":14},null,"(",")",null,null,null,null,null,null,{"$f":"SUM(U15:U71)","v":0}]
[null,null,"          Fire safety specialist officer review completed. \n          Ok to continue processing         ",null,{"$f":"IF(U72>0,\"NOTE: RFI ON THIS DISCIPLINE - CANNOT SIGNOFF AT PRESENT\",\"\")","v":""},"Adrienne Slattery (Jonathan Nyman from 13/7/2017)","2017-08-01",null,null,null,true,"ON HOLD",{"$f":"F73","v":"Adrienne Slattery (Jonathan Nyman from 13/7/2017)"}]

{"sheet":"B151b-Fire safety specialist","index":8,"n_rows":43,"n_cols":26,"rows_kept":43,"cut":false,"hidden":false,"merged":[[7,8,7,9],[3,1,3,6],[5,1,5,3],[5,4,5,6],[6,1,6,3],[6,4,6,6],[4,1,4,6],[7,1,7,3],[7,4,7,6],[8,1,8,3],[8,4,8,6],[9,1,9,3],[9,4,9,6],[39,1,39,2],[10,1,10,6],[18,1,18,6],[37,1,37,2],[23,1,23,2],[25,1,25,2],[11,4,17,6],[11,1,11,2]]}
[null,null,null,null,null,null,null,null,"Summary sheet","B501-Not accepted letter"]
[null,"B-151b LU: 09.10.15, v3 LR: 09.10.15, v3",null,null,null,null,null,null,"Vetting sheet","B501a-Not accepted with invoice"]
[null,null,null,null,null,null,null,null,"B120-Processing sheet","Application update letter"]
[false,{"$f":"IF(Z4=TRUE,\"                  SPECIALIST REVIEW ON THIS PROCESSING SHEET IS NOT APPLICABLE TO THIS APPLICATION\",\"\")","v":"                  SPECIALIST REVIEW ON THIS PROCESSING SHEET IS NOT APPLICABLE TO THIS APPLICATION"},null,null,null,null,null,null,"B150-Structural specialist","B521-RFI letter",null,null,null,null,null,null,null,null,null,null,null,null,null,null,{"$f":"Z4","v":true},{"$f":"IF(Y7<1,TRUE,FALSE)","v":true}]
[null,"FORM B-151b                                                SPECIALIST FIRE SAFETY PROCESSING SHEET (During and Post Fire)",null,null,null,null,null,null,"B151a-Fire safety specialist","B529-Final reminder letter",null,null,null,null,null,null,null,null,null,null,null,null,null,null,{"$f":"IF(Z5=\"yes\",1,\"\")","v":""},{"$f":"'Summary sheet'!C44","v":"N/A"}]
[null,"Building consent number (BCN):   ","Building consent number (BCN):   ","Building consent number (BCN):   ",{"$f":"'Summary sheet'!E15","v":"BCN/2017/2013"},null,null,null,"B151b-Fire safety specialist","B532-Refusal letter",null,"Y",null,null,null,null,null,null,null,null,null,null,null,null,{"$f":"IF(Z6=\"yes\",1,\"\")","v":""},{"$f":"'Summary sheet'!C43","v":"N/A"}]
[null,"Project address:   ","Project address:   ","Project address:   ",{"$f":"'Summary sheet'!E16","v":"80 Byron Street Sydenham "},null,null,null,"B160-PS specialist","S71-74 natural hazards",null,"N/A",null,null,null,null,null,null,null,null,null,null,null,null,{"$f":"SUM(Y5:Y6)","v":0}]
[null,"Description of building work:","Project description:","Project description:",{"$f":"'Summary sheet'!E17","v":"Addition to Factory - New Offices, Meeting and Store Room"},null,null,null,"B462-Draft CS",null,null,"RFI"]
[null,"Building level:        ","Building level:        ","Building level:        ",{"$f":"'Summary sheet'!E18","v":"Commercial 1"}]
[null,"Classified use(s):  ","Classified use(s):  ","Classified use(s):  ",{"$f":"'Summary sheet'!E19","v":"Commercial"}]
[]
[null,"Items reviewed: (items to be added by the first reviewer of the application, either specialist or BCO)",null,"OK (for specialist use only)","Key for abbreviations to answering processing questions\nY - The application satisfies the intent of the question. Provide comment if appropriate\nN/a - The question is not applicable to this application. Provide comment if appropriate\nRFI - The application has not meet the intent of this question and a request for information is required. Write request in RFI cell for inclusion in RFI letter. The application must not be granted until all RFIs are resolved and the answer has been changed to Yes or N/a\nUse Resolved or Not resolved in the far right column to indicate status of RFI item after receiving a response to the RFI item. This will appear on any further RFI letters"]
[null,1]
[null,2]
[null,3]
[null,4]
[null,5]
[null,6]
[null,"To Fire Specialists:  Building elements that provide ‘during and post fire stability’ that are constructed from heavy timber, steel, or concrete, or include base isolation will require review by a structural specialist.. If applicable both to provide sign-off to processing sheet.",null,null,null,null,null,null,null,null,null,"Resolved"]
[null,null,"Items to be checked","(Y, N/a RFI)","Comments","RFI","RFI Resolved",null,null,null,null,"Not Resolved"]
[null,"REQUIRED FIRE RATING",null,null,null,null,null,null,null,null,null,"The specialist fire safety reviewer of this application requires "]
[null,1,"Fire Rating - Property rating specified - Property rating =\n",null,null,null,null,null,null,null,{"$f":"IF(F22=\"\",\"\",2)","v":""},"The specialist structural reviewer of this application requires",null,null,null,null,null,null,null,null,null,null,null,{"$f":"IF(D22=\"RFI\",1,(IF(G22=\"NOT RESOLVED\",1,\"\")))","v":""}]
[null,2,"Plan - Fire rating plan provided - Page numbers & HPRM doc number\n",null,null,null,null,null,null,null,{"$f":"IF(F23=\"\",\"\",2)","v":""},"The performance required by this item is not applicable to the building work included in this application",null,null,null,null,null,null,null,null,null,null,null,{"$f":"IF(D23=\"RFI\",1,(IF(G23=\"NOT RESOLVED\",1,\"\")))","v":""}]
[null,"PRODUCER STATEMENT:  ",null,null,null,null,null,null,null,null,null,"This item is not applicable because the existing building's compliance is unchanged the building work included in this application"]
[null,3,"Producer statement - C6 is covered by PS1 from a CPEng structural engineer. \n",null,null,null,null,null,null,null,{"$f":"IF(F25=\"\",\"\",2)","v":""},null,null,null,null,null,null,null,null,null,null,null,null,{"$f":"IF(D25=\"RFI\",1,(IF(G25=\"NOT RESOLVED\",1,\"\")))","v":""}]
[null,"CALCULATION & DESIGN"]
[null,4,"Lightweight Timber - Boundary wall – frame construction complying with GIB System (140 mm frame) or specific calculation provided.\nBoundary wall calculation is to be checked by structural specialist. GIB system can be checked by either fire or structural specialist.",null,null,null,null,null,null,null,{"$f":"IF(F27=\"\",\"\",2)","v":""},null,null,null,null,null,null,null,null,null,null,null,null,{"$f":"IF(D27=\"RFI\",1,(IF(G27=\"NOT RESOLVED\",1,\"\")))","v":""}]
[null,5,"Heavy Timber -  Beam and Column calculation considering charring provided (In compliance with Section 9.4 of NZS3603, Timber Design Guide, or Eurocode 5) \nCharring rate in NZS4603 is 0.65 mm per minute, in Eurocode 5 there are different values depends on the timber type. These values should not be mixed. \nNZS3603 includes rounding at the corners, Timber Design Guide has reduced strength area. Eurocode 5 has both methods. \nThis design method should not be used for beams or columns less than 90 mm in any dimension. If this has been used outside of NZS 3603 then request a PS2. We can accept PS2 from Geoff Thomas or Andy Buchanan.",null,null,null,null,null,null,null,"",null,null,null,null,null,null,null,null,null,null,null,null,""]
[null,6,"Heavy Timber - Nailed and Bolted connection – compliance with paragraph 9.5.3 of NZS3063",null,null,null,null,null,null,null,"",null,null,null,null,null,null,null,null,null,null,null,null,""]
[null,7,"Heavy Timber - Glued members need to be thermo-setting.\nIf glue is proposed to be used, discuss with the fire specialist about the material properties.",null,null,null,null,null,null,null,"",null,null,null,null,null,null,null,null,null,null,null,null,""]
[null,8,"Steel construction - Board system –shown in architectural drawings\n",null,null,null,null,null,null,null,"",null,null,null,null,null,null,null,null,null,null,null,null,""]
[null,9,"Steel construction - Intumescent paint – drawings showing which members are to be painted, and calculation of limiting temperatures of these members provided.\nLimiting temperature calculation should be from NZS 3404. Please check the G and Q are consistent with the rest of the structural calculation.",null,null,null,null,null,null,null,"",null,null,null,null,null,null,null,null,null,null,null,null,""]
[null,10,"Steel construction - Concrete encasement – Eurocode 4 tables.\nConcrete filled steel columns may use the method by V Kodur. Concrete encasement should follow Eurocode 4.",null,null,null,null,null,null,null,"",null,null,null,null,null,null,null,null,null,null,null,null,""]
[null,11,"Steel construction - Specific calculation – using NZS 3404 or Eurocode 3.",null,null,null,null,null,null,null,"",null,null,null,null,null,null,null,null,null,null,null,null,""]
[null,12,"Concrete construction - During and post fire stability provided for all external walls – including consideration of the combination of thermal effect and 0.5 kPa face load.",null,null,null,null,null,null,null,"",null,null,null,null,null,null,null,null,null,null,null,null,""]
[null,13,"Concrete construction - Connection design provided to show compliance with paragraph 4.8.2 of NZS 3101.",null,null,null,null,null,null,null,"",null,null,null,{"$f":"IF(AND(F41<>\"\",F42<>\"\"),\" & \",\"\")","v":""},null,null,null,null,null,null,null,null,""]
[null,14,"Base isolation - provided with specific design\n",null,null,null,null,null,null,null,"",null,null,null,null,null,null,null,null,null,null,null,null,""]
[null,"BUILDING CONSENT:",null,null,null,null,null,null,null,null,null,null,null,null,{"$f":"O40&\" \"&O41&O42&O36&O43&P41","v":"Specialist Review : During & Post Fire Stability ()"}]
[null,15,"Reviewed by both structural and fire specialists \nIf N/a state reasons why",null,null,null,null,null,null,null,{"$f":"IF(F39=\"\",\"\",2)","v":""},null,null,null,null,null,null,null,null,null,null,null,null,{"$f":"IF(D39=\"RFI\",1,(IF(G39=\"NOT RESOLVED\",1,\"\")))","v":""}]
[null,"SPECIALIST REVIEW COMPLETED",null,null,null,"Specialist Name ","Status/Date Completed",null,null,null,{"$f":"SUM(K22:K39)","v":0},null,null,null,"Specialist Review : During & Post Fire Stability",null,null,null,null,null,null,null,null,{"$f":"SUM(X22:X39)","v":0}]
[null,null,"          Fire safety specialist officer review completed. \n          Ok to continue processing         ",null,{"$f":"IF(X40>0,\"NOTE: CHECKLIST INCOMPLETE- IGNORE IF N/A FOR YOUR DISCIPLINE\",\"\")","v":""},null,null,null,null,null,null,"ON HOLD",null,null,"(",")",null,null,null,null,null,null,null,null,false]
[null,null,"          Structural specialist officer review completed. (if applicable)\n          Ok to continue processing         ",null,{"$f":"IF(X40>0,\"NOTE: CHECKLIST INCOMPLETE - IGNORE IF N/A FOR YOUR DISCIPLINE\",\"\")","v":""},null,null,null,null,null,null,null,null,null,{"$f":"IF(F41=\"\",\"\",F41)","v":""},null,null,null,null,null,null,null,null,null,false]
[null,null,null,null,null,null,null,null,null,null,null,null,null,null,{"$f":"IF(F42=\"\",\"\",F42)","v":""}]

{"sheet":"B160-PS specialist","index":9,"n_rows":32,"n_cols":29,"rows_kept":32,"cut":false,"hidden":false,"merged":[[7,8,7,9],[7,1,7,3],[7,4,7,6],[26,1,26,2],[29,1,29,2],[8,1,8,3],[8,4,8,6],[9,1,9,3],[9,4,9,6],[10,1,10,6],[19,1,19,2],[3,1,3,6],[5,1,5,3],[5,4,5,6],[6,1,6,3],[6,4,6,6],[4,1,4,6],[19,26,19,27],[30,3,30,4],[23,1,23,2],[11,4,17,6],[11,1,11,2]]}
[null,null,null,null,null,null,null,null,"Summary sheet","B501-Not accepted letter"]
[null,"B-160 LU: 01.03.16 LR: 01.03.16 v8",null,null,null,null,null,null,"Vetting sheet","B501a-Not accepted with invoice"]
[null,null,null,null,null,null,null,null,"B120-Processing sheet","Application update letter"]
[null,{"$f":"IF(Z4=\"N/A\",\"                  SPECIALIST REVIEW ON THIS PROCESSING SHEET IS NOT APPLICABLE TO THIS APPLICATION\",\"\")","v":""},null,null,null,null,null,null,"B150-Structural specialist","B521-RFI letter",null,null,null,null,null,null,null,null,null,null,null,null,null,null,{"$f":"IF(Z4=\"N/A\",TRUE,FALSE)","v":false},{"$f":"'Summary sheet'!C45","v":"Yes"}]
[null,"Form B-160                                                      SERVICES SPECIALIST PROCESSING SHEET (Producer Statements for: G4, G9 and D2)",null,null,null,null,null,null,"B151a-Fire safety specialist","B529-Final reminder letter"]
[null,"Building consent number (BCN):   ","Building consent number (BCN):   ","Building consent number (BCN):   ",{"$f":"'Summary sheet'!E15","v":"BCN/2017/2013"},null,null,null,"B151b-Fire safety specialist","B532-Refusal letter",null,"Y"]
[null,"Project address:   ","Project address:   ","Project address:   ",{"$f":"'Summary sheet'!E16","v":"80 Byron Street Sydenham "},null,null,null,"B160-PS specialist","S71-74 natural hazards",null,"N/A"]
[null,"Description of building work:","Project description:","Project description:",{"$f":"'Summary sheet'!E17","v":"Addition to Factory - New Offices, Meeting and Store Room"},null,null,null,"B462-Draft CS",null,null,"RFI"]
[null,"Building level:        ","Building level:        ","Building level:        ",{"$f":"'Summary sheet'!E18","v":"Commercial 1"}]
[null,"Classified use(s):  ","Classified use(s):  ","Classified use(s):  ",{"$f":"'Summary sheet'!E19","v":"Commercial"}]
[]
[null,"Items reviewed: (items to be added by the first reviewer of the application, either specialist or BCO)",null,"OK (for specialist use only)","Key for abbreviations to answering processing questions\nY - The application satisfies the intent of the question. Provide comment if appropriate\nN/a - The question is not applicable to this application. Provide comment if appropriate\nRFI - The application has not meet the intent of this question and a request for information is required. Write request in RFI cell for inclusion in RFI letter. The application must not be granted until all RFIs are resolved and the answer has been changed to Yes or N/a\nUse Resolved or Not resolved in the far right column to indicate status of RFI item after receiving a response to the RFI item. This will appear on any further RFI letters"]
[null,1]
[null,2]
[null,3]
[null,4]
[null,5]
[null,6,null,null,null,null,null,null,null,null,null,"Resolved"]
[null,null,"Items to be checked","(Y, N/a RFI)","Comments","RFI","RFI Resolved",null,null,null,null,"Not Resolved"]
[null,{"$f":"AA20&\" \"&AA21","v":"G4 - VENTILATION "},null,null,null,null,null,null,null,null,null,"The specialist services reviewer of this application requires ",null,null,null,null,null,null,null,null,null,null,null,null,false,{"$f":"IF(Y20=TRUE,TRUE,(AND(SUM(Y21:Y23)=0,Y20=FALSE)))","v":true},"G4 - VENTILATION"]
[null,1,"Compliance with G4 - G4 / VM1 Ventilation Rate and Air Purity\nKitchen hoods - Type A local exhaust\nKitchen hoods - Type B local exhaust\nParking buildings & basements\nOther spaces (please list)","Y","Producer statement design (PS1) with drawing schematically showing duct runs, diffuser positions etc.\nApplication covers ventilation services for \n","The specialist services reviewer of this application requires the following additional information:\n\nPlease provide PS1 (Design) and associated design details, showing Compliance with Clauses G4 and H1.3.6 of the New Zealand Building Code. Also, a schedule of inspections to be undertaken by the engineer with confirmation that 'as built' drawings and a PS4 will be provided on successful commissioning of the ventilation systems.                      Response received 12/7/17 does not address RFI                                            Response received 1/8/17 gives no indication of how internal office and meeting room are ventilated, does not give any extract rates for toilets and PS1 provided gives no indication that PS4 will be provided.\n","Resolved",null,null,null,{"$f":"IF(F21=\"\",\"\",2)","v":2},"The performance required by this item is not applicable to the building work included in this application",null,null,null,null,null,null,null,null,null,null,null,{"$f":"IF(D21=\"RFI\",1,(IF(G21=\"NOT RESOLVED\",1,\"\")))","v":""},{"$f":"IF(D21=\"\",1,(IF(D21=\"RFI\",1,(IF(G21=\"NOT RESOLVED\",1,\"\")))))","v":""},null,{"$f":"IF(Z23=TRUE,\": REVIEW INCOMPLETE\",\"\")","v":""},null,{"$f":"IF(AA21=\"\",\"\",1)","v":""}]
[null,2,"Compliance with H1.3.6: In commercial buildings ensure the Performance Section H1.3.6 (HVAC efficiency) been included in the design and is either covered by the PS or statement by designer. (See practice note PN095 for explanation.)","Y","Referenced on the producer statement design (PS1)  ",null,null,null,null,null,{"$f":"IF(F22=\"\",\"\",2)","v":""},"This item is not applicable because the existing building's compliance is unchanged the building work included in this application",null,null,null,null,null,null,null,null,null,null,null,{"$f":"IF(D22=\"RFI\",1,(IF(G22=\"NOT RESOLVED\",1,\"\")))","v":""},{"$f":"IF(D22=\"\",1,(IF(D22=\"RFI\",1,(IF(G22=\"NOT RESOLVED\",1,\"\")))))","v":""},{"$f":"IF(Y20=TRUE,\"NO NEED 1\",IF(Z20=TRUE, \"NO NEED 2\",\"NEED\"))","v":"NO NEED 2"}]
[null,3,"Producer statements for design and design review are to;\n• be accompanied by supporting information e.g. calculations and test reports.\n• clearly describe the building work that it is covering\n• state the address of where the proposed building work is to be carried out (exception for producer statements for proprietary building systems)\n• state the building code clauses that the building work will comply with\n• state the means of compliance used for assessing the building work’s compliance with the relevant building code clauses.\n• reference the drawings being covered\n• state any verification of design assumptions\n• state whether construction monitoring is to be undertaken by the design professional and precisely which building elements are to be inspected\n• state the author’s qualifications and registration number\n• be signed and dated","Y","PS1: describes the work covered and references the drawing, states the street address, references NZBC clauses G4 & H1.3.6, identifies compliance with the acceptable solutions and identifies the author as while not being CPEng qualified,  is known by Council to have competence in this field and has a proven service history and is signed and dated by the author: \nNigel Walsh - Mecserve Limited\nHVAC installation: The HVAC subcontractor shall provide “as built” drawings and details of the HVAC system. \n\nAs stated on the PS1  / RFI response, the applicant has agreed to engage Mecserve Limited to provide a producer statement construction review (PS4) upon satisfactory completion of commissioning, verifying that the HVAC system has been completed to the extent required by the building consent.\n",null,null,null,null,null,{"$f":"IF(F23=\"\",\"\",2)","v":""},null,null,{"$f":"SUM(K21:K23)","v":2},null,"Specialist Review : Mechanical Ventilation",null,null,null,{"$f":"P23&\"  \"&P31&P30&Q31","v":"Specialist Review : Mechanical Ventilation  (Nick Waddington )"},null,null,null,{"$f":"IF(D23=\"RFI\",1,(IF(G23=\"NOT RESOLVED\",1,\"\")))","v":""},{"$f":"IF(D23=\"\",1,(IF(D23=\"RFI\",1,(IF(G23=\"NOT RESOLVED\",1,\"\")))))","v":""},{"$f":"IF(Z22=\"NEED\", TRUE, FALSE)","v":false}]
[null,{"$f":"AA24&\" \"&AA25","v":"G9 - ELECTRICAL INSTALLATIONS: (excludes emergency lighting) "},null,null,null,null,null,null,null,null,null,null,null,null,null,null,null,null,null,null,null,null,null,null,true,{"$f":"IF(Y24=TRUE,TRUE,(AND(SUM(Y25:Y26)=0,Y24=FALSE)))","v":true},"G9 - ELECTRICAL INSTALLATIONS: (excludes emergency lighting)"]
[null,4,"Compliance with G9 - G9 /VM1 Electrical Installation - Specification \nDesign and Build  \nInformation only\nFull documentation ",null,null,null,null,null,null,null,{"$f":"IF(F25=\"\",\"\",2)","v":""},null,null,null,null,"Specialist Review : Electrical",null,null,null,null,null,null,null,{"$f":"IF(D25=\"RFI\",1,(IF(G25=\"NOT RESOLVED\",1,\"\")))","v":""},{"$f":"IF(D25=\"\",1,(IF(D25=\"RFI\",1,(IF(G25=\"NOT RESOLVED\",1,\"\")))))","v":1},{"$f":"IF(Y24=TRUE,\"NO NEED 1\",IF(Z24=TRUE, \"NO NEED 2\",\"NEED\"))","v":"NO NEED 1"},{"$f":"IF(Z26=TRUE,\":  REVIEW INCOMPLETE\",\"\")","v":""},null,{"$f":"IF(AA25=\"\",\"\",1)","v":""}]
[null,5,"Producer statements for design and design review are to;\n• be accompanied by supporting information e.g. calculations and test reports.\n• clearly describe the building work that it is covering\n• state the address of where the proposed building work is to be carried out (exception for producer statements for proprietary building systems)\n• state the building code clauses that the building work will comply with\n• state the means of compliance used for assessing the building work’s compliance with the relevant building code clauses.\n• reference the drawings being covered\n• state any verification of design assumptions\n• state whether construction monitoring is to be undertaken by the design professional and precisely which building elements are to be inspected\n• state the author’s qualifications and registration number\n• be signed and dated",null,null,null,null,null,null,null,{"$f":"IF(F26=\"\",\"\",2)","v":""},null,null,{"$f":"SUM(K25:K26)","v":0},null,{"$f":"P25&\"  \"&P31&P30&Q31","v":"Specialist Review : Electrical  (Nick Waddington )"},null,null,null,null,null,null,null,{"$f":"IF(D26=\"RFI\",1,(IF(G26=\"NOT RESOLVED\",1,\"\")))","v":""},{"$f":"IF(D26=\"\",1,(IF(D26=\"RFI\",1,(IF(G26=\"NOT RESOLVED\",1,\"\")))))","v":1},{"$f":"IF(Z25=\"NEED\", TRUE, FALSE)","v":false}]
[null,{"$f":"AA27&\" \"&AA28","v":"D2 - MECHANICAL INSTALLATIONS FOR ACCESS: "},null,null,null,null,null,null,null,null,null,null,null,null,null,null,null,null,null,null,null,null,null,null,true,{"$f":"IF(Y27=TRUE,TRUE,(AND(SUM(Y28:Y29)=0,Y27=FALSE)))","v":true},"D2 - MECHANICAL INSTALLATIONS FOR ACCESS:"]
[null,6,"Compliance with D2 - D2/VM1/AS1 Passenger Carrying Lifts, D2/AS2 \nDomestic and Service Lifts, D2/VM3/AS3 Escalators and Moving Walks\nLift\nEscalator\nMoving walks\nList: Installer / Manufacturer / Model",null,null,null,null,null,null,null,{"$f":"IF(F28=\"\",\"\",2)","v":""},null,null,null,null,null,null,null,null,null,null,null,null,{"$f":"IF(D28=\"RFI\",1,(IF(G28=\"NOT RESOLVED\",1,\"\")))","v":""},{"$f":"IF(D28=\"\",1,(IF(D28=\"RFI\",1,(IF(G28=\"NOT RESOLVED\",1,\"\")))))","v":1},{"$f":"IF(Y27=TRUE,\"NO NEED 1\",IF(Z27=TRUE, \"NO NEED 2\",\"NEED\"))","v":"NO NEED 1"},{"$f":"IF(Z29=TRUE,\":  REVIEW INCOMPLETE\",\"\")","v":""},null,{"$f":"IF(AA28=\"\",\"\",1)","v":""}]
[null,7,"Producer statements for design and design review are to;\n• be accompanied by supporting information e.g. calculations and test reports.\n• clearly describe the building work that it is covering\n• state the address of where the proposed building work is to be carried out (exception for producer statements for proprietary building systems)\n• state the building code clauses that the building work will comply with\n• state the means of compliance used for assessing the building work’s compliance with the relevant building code clauses.\n• reference the drawings being covered\n• state any verification of design assumptions\n• state whether construction monitoring is to be undertaken by the design professional and precisely which building elements are to be inspected\n• state the author’s qualifications and registration number\n• be signed and dated",null,null,null,null,null,null,null,{"$f":"IF(F29=\"\",\"\",2)","v":""},null,null,{"$f":"SUM(K28:K29)","v":0},null,"Specialist Review : Mechanical Access",null,null,null,null,null,null,null,{"$f":"IF(D29=\"RFI\",1,(IF(G29=\"NOT RESOLVED\",1,\"\")))","v":""},{"$f":"IF(D29=\"\",1,(IF(D29=\"RFI\",1,(IF(G29=\"NOT RESOLVED\",1,\"\")))))","v":1},{"$f":"IF(Z28=\"NEED\", TRUE, FALSE)","v":false}]
[null,"SPECIALIST REVIEW COMPLETED",null,null,null,"Specialist Name ","Status/Date Completed",null,null,null,null,null,null,null,null,{"$f":"(F31)","v":"Nick Waddington "},null,null,null,null,null,null,null,{"$f":"SUM(X21:X29)","v":0}]
[null,null,"          Services specialist officer review completed. \n          Ok to continue processing         ",{"$f":"IF(AC31>0,\"NOTE: PROCESSING INCOMPLETE - CANNOT SIGNOFF AT PRESENT\",\"\")","v":""},null,"Nick Waddington ","2017-08-15",null,null,null,true,"ON HOLD",null,null,null,"(",")",null,null,null,null,null,null,null,null,null,null,null,{"$f":"SUM(AC28:AC29,AC25:AC26,AC21:AC23)","v":0}]
[null,null,null,null,null,null,null,null,null,null,null,null,null,null,null,{"$f":"P29&\"  \"&P31&P30&Q31","v":"Specialist Review : Mechanical Access  (Nick Waddington )"}]

{"sheet":"S71-74 natural hazards","index":10,"n_rows":30,"n_cols":20,"rows_kept":30,"cut":false,"hidden":false,"merged":[[7,8,7,9],[13,1,13,6],[14,1,14,6],[16,1,16,2],[28,1,28,4],[10,1,10,3],[10,4,10,6],[11,1,11,3],[11,4,11,6],[12,1,12,3],[12,4,12,6],[6,1,6,6],[7,1,7,6],[8,1,8,3],[8,4,8,6],[9,1,9,3],[9,4,9,6]]}
[null,null,null,null,null,null,null,null,"Summary sheet","B501-Not accepted letter"]
[null,null,null,null,null,null,null,null,"Vetting sheet","B501a-Not accepted with invoice"]
[null,null,null,null,null,null,null,null,"B120-Processing sheet","Application update letter"]
[null,null,null,null,null,null,null,null,"B150-Structural specialist","B521-RFI letter"]
[null,"B-100C LU: 20.12.16 LR: 20.12.16 v7",null,null,null,null,null,null,"B151a-Fire safety specialist","B529-Final reminder letter"]
[null,null,null,null,null,null,null,null,"B151b-Fire safety specialist","B532-Refusal letter"]
[null,{"$f":"IF(R7=\"N/A\",\"                  REVIEW ON THIS PROCESSING SHEET IS NOT APPLICABLE TO THIS APPLICATION\",\"\")","v":"                  REVIEW ON THIS PROCESSING SHEET IS NOT APPLICABLE TO THIS APPLICATION"},null,null,null,null,null,null,"B160-PS specialist","S71-74 natural hazards",null,null,null,null,null,null,{"$f":"IF(R7=\"N/A\",TRUE,FALSE)","v":true},{"$f":"'Summary sheet'!$C$46","v":"N/A"}]
[null,"BUILDING ON LAND SUBJECT TO NATURAL HAZARDS PROCESSING SHEET",null,null,null,null,null,null,"B462-Draft CS"]
[null,"Building consent number (BCN):   ","Building consent number (BCN):   ","Building consent number (BCN):   ",{"$f":"'Summary sheet'!E15","v":"BCN/2017/2013"}]
[null,"Project address:   ","Project address:   ","Project address:   ",{"$f":"'Summary sheet'!E16","v":"80 Byron Street Sydenham "},null,null,null,null,null,null,"Y",null,"Resolved"]
[null,"Description of building work:","Project description:","Project description:",{"$f":"'Summary sheet'!E17","v":"Addition to Factory - New Offices, Meeting and Store Room"},null,null,null,null,null,null,"N/A",null,"Not Resolved"]
[null,"Building level:        ","Building level:        ","Building level:        ",{"$f":"'Summary sheet'!E18","v":"Commercial 1"},null,null,null,null,null,null,"RFI"]
[null,"Classified use(s):  ","Classified use(s):  ","Classified use(s):  ",{"$f":"'Summary sheet'!E19","v":"Commercial"}]
[null,null,null,null,null,null,null,null,null,null,null,"Comments","RFI"]
[null,"Key for abbreviations to answering processing questions\nY - The application satisfies the intent of the question. Provide comment if appropriate\nN/a - The question is not applicable to this application. Provide comment if appropriate\nRFI - The application has not meet the intent of this question and a request for information is required. Write request in RFI cell for inclusion in RFI letter. The application must not be granted until all RFIs are resolved and the answer has been changed to Yes or N/a\nUse Resolved or Not resolved in the far right column to indicate status of RFI item after receiving a response to the RFI item. This will appear on any further RFI letters"]
[null,null,"Processing steps\nAlso refer to inserted comments","Y, N/A RFI","Comments","RFI","RFI Resolved"]
[null,null,null,null,null,null,null,null,null,null,null,null,null,null,null,null,null,null,"GENERAL / PIM / SITE:  "]
[null,1,"Is the building consent application for (a) construction of a building or (b) major alteration? \nIf the answer is Yes, to either (a) or (b) proceed to Step (2).  \nIf the answer is No, process the building consent as normal, (Section 71 does not apply so sections 72 & 73 are not involved)",null,null,null,null,null,null,null,null,null,null,null,null,{"$f":"IF(D18=\"RFI\",1,\"\")","v":""},{"$f":"IF(D18=\"\",1,(IF(D18=\"RFI\",1,(IF(G18=\"NOT RESOLVED\",1,\"\")))))","v":1},{"$f":"SUM(Q18:Q21)","v":4},{"$f":"IF(R20=TRUE,\"REVIEW INCOMPLETE\",\"\")","v":"REVIEW INCOMPLETE"},{"$f":"IF(S18<>\"\",1,\"\")","v":1}]
[null,2,"(a) Is the land on which the building work is carried out is subject or likely to be subject to 1 or more natural hazards? or \n(b)  The building work is likely to accelerate, worsen, or result in a natural hazard on that land or any other property?\nIf the answer is Yes, to either (a) or (b) proceed to Step (3).  \nIf the answer is No, process the Building Consent as normal, (Section 71 does not apply so sections 72 & 73 are not involved)",null,null,null,null,null,null,null,null,null,null,null,null,{"$f":"IF(D19=\"RFI\",1,\"\")","v":""},{"$f":"IF(D19=\"\",1,(IF(D19=\"RFI\",1,(IF(G19=\"NOT RESOLVED\",1,\"\")))))","v":1}]
[null,3,"Have you given consideration to the following question?\n Are you satisfied that adequate provision has been made or will be made to -\n (a)  Protect the land, building work, and other property from the natural hazard(s)? – see section 71(2)(a)\n(Or)\nRestore any damage to that land or other property as a result of the building work? – see section 71(2)(b)\nThe answer is Yes for an inundation hazard if the measures noted in paragraph 1.9 PN10 have been met without requiring substantial siteworks. In these cases the BCO may determine that there is adequate provision as per s71 (2) and continue to process the building consent as normal \nA Yes for all other provisions, be it filling, bunding of the property or acceptance of lesser protection will be assessed on a case by case basis to determine if the provision is adequate and will not affect other property. This decision will require consultation with the Network Planning Team and must be peer reviewed as per Step (8) \nIf the answer is No. proceed to step (4).",null,null,null,null,null,null,null,null,null,null,null,null,{"$f":"IF(D20=\"RFI\",1,\"\")","v":""},{"$f":"IF(D20=\"\",1,(IF(D20=\"RFI\",1,(IF(G20=\"NOT RESOLVED\",1,\"\")))))","v":1},{"$f":"IF(R18>0,TRUE,FALSE)","v":true}]
[null,4,"Have you given consideration to the following question?\nWill the building work accelerate, worsen or result in a natural hazard on the land on which the building work is to be carried out or on any other property? (Section 72(a)) \nf the answer is Yes, refuse the building consent and proceed to step (8). \nIf the answer is No, proceed to step (5). ",null,null,null,null,null,null,null,null,null,null,null,null,{"$f":"IF(D22=\"RFI\",1,\"\")","v":""},{"$f":"IF(D22=\"\",1,(IF(D22=\"RFI\",1,(IF(G22=\"NOT RESOLVED\",1,\"\")))))","v":1}]
[null,5,"Have you given consideration to the following question?\nIf applicable, is it reasonable to grant a waiver or modification?  \nDescribe why the answer is yes or no, or not applicable",null,null,null,null,null,null,null,null,null,null,null,null,{"$f":"IF(#REF!=\"RFI\",1,\"\")","v":{"$error":"#REF!"}},null,null,{"$f":"IF(#REF!=1,\"REVIEW INCOMPLETE\",\"\")","v":{"$error":"#REF!"}},{"$f":"IF(S22<>\"\",1,\"\")","v":{"$error":"#REF!"}}]
[null,6,"Complete a B-041 form and send to the applicant in order for the owner to acknowledge that they are aware that the building consent will be issued subject to a hazard notice. Also attach the information sheet B-317 Building on land that is subject to natural hazards – Advice to landowners  \nThe form must clearly identify the type and description of natural hazard. "]
[null,7,"Has the property owner signed the B-041 form?",null,null,null,null,null,null,null,null,null,null,null,null,{"$f":"IF(D25=\"RFI\",1,\"\")","v":""},{"$f":"IF(D24=\"\",1,(IF(D24=\"RFI\",1,(IF(G24=\"NOT RESOLVED\",1,\"\")))))","v":1},{"$f":"IF(#REF!=TRUE,\"NO NEED 1\",IF(#REF!=TRUE, \"NO NEED 2\",\"NEED\"))","v":{"$error":"#REF!"}},{"$f":"IF(S25=TRUE,\"REVIEW INCOMPLETE\",\"\")","v":{"$error":"#REF!"}},{"$f":"IF(S24<>\"\",1,\"\")","v":{"$error":"#REF!"}}]
[null,8,"Has your decision to grant or refuse a building consent been peer reviewed?\nPeer reviewer's name and date",null,null,null,null,null,null,null,null,null,null,null,null,{"$f":"IF(D26=\"RFI\",1,\"\")","v":""},{"$f":"IF(D25=\"\",1,(IF(D25=\"RFI\",1,(IF(G25=\"NOT RESOLVED\",1,\"\")))))","v":1},null,{"$f":"IF(R24=\"NEED\", TRUE, FALSE)","v":{"$error":"#REF!"}}]
[null,9,"Has a Legal Services Unit request been sent to notify the Registrar-General of Land?\nSteps 9 and 10 only applicable if the decision is to grant the building consent under s72",null,null,null,null,null,null,null,null,null,null,null,null,{"$f":"IF(#REF!=\"RFI\",1,\"\")","v":{"$error":"#REF!"}},{"$f":"IF(D26=\"\",1,(IF(D26=\"RFI\",1,(IF(G26=\"NOT RESOLVED\",1,\"\")))))","v":1}]
[null,10,"Building Act condition -COND-S73 and Connect decision - GRNS72 have been added in Connect?"]
[]
[null,"BCO REVIEW COMPLETED",null,null,null,"BCO Name","Status/Date Completed",null,null,null,null,null,null,null,null,null,false,null,null,{"$f":"SUM(T18:T27)","v":{"$error":"#REF!"}}]
[null,null,"          BCO review completed. \n          Ok to continue processing         ",null,null,null,null,null,null,null,null,"ON HOLD"]

{"sheet":"B501-Not accepted letter","index":11,"n_rows":153,"n_cols":16,"rows_kept":153,"cut":false,"hidden":false,"merged":[[8,4,8,5],[9,1,9,2],[144,1,144,2],[148,1,148,2],[15,1,15,2],[12,1,12,2],[13,1,13,2],[16,1,16,2],[146,1,146,2],[1,1,1,2],[3,1,3,2],[4,1,4,2],[6,1,6,2],[5,1,5,2]]}
[]
[null,{"$f":"TODAY()","v":"2017-08-20"},null,null,"Summary sheet","B501-Not accepted letter"]
[null,null,null,null,"Vetting sheet","B501a-Not accepted with invoice"]
[null,{"$f":"'Summary sheet'!E7","v":"Trevor Jones "},null,null,"B120-Processing sheet","Application update letter",null,null,null,null,null,null,null,null,null,"C/-"]
[null,{"$f":"'Summary sheet'!$E$9","v":"47 Second Avenue , Tauranga"},null,null,"B150-Structural specialist","B521-RFI letter"]
[null,{"$f":"'Summary sheet'!E10&\"\"","v":"Tauranga"},null,null,"B151a-Fire safety specialist","B529-Final reminder letter"]
[null,{"$f":"'Summary sheet'!$E$8","v":"trevor@architecturaldesigngroup.co.nz"},null,null,"B151b-Fire safety specialist","B532-Refusal letter"]
[null,null,null,null,"B160-PS specialist","S71-74 natural hazards"]
[null,null,null,null,"B462-Draft CS"]
[null,{"$f":"\"Dear\"&\" \"&'Summary sheet'!E11","v":"Dear Sir / Madam"}]
[]
[null,{"$f":"P12&\" \"&'Summary sheet'!E15","v":"Building Consent: BCN/2017/2013"},null,null,null,null,null,null,null,null,null,null,null,null,null,"Building Consent:"]
[null,{"$f":"'Summary sheet'!$E$16","v":"80 Byron Street Sydenham "},null,{"$f":"B13","v":"80 Byron Street Sydenham "}]
[null,{"$f":"'Summary sheet'!E17","v":"Addition to Factory - New Offices, Meeting and Store Room"},null,{"$f":"B14","v":"Addition to Factory - New Offices, Meeting and Store Room"}]
[]
[null,"Application Not Accepted"]
[null,"\nWe have completed a pre-acceptance technical check of your application. As the following information was not supplied, we are unable to accept your application:",null,{"$f":"B17","v":"\nWe have completed a pre-acceptance technical check of your application. As the following information was not supplied, we are unable to accept your application:"}]
[null,"\nCode\n","Missing information\n"]
[null,"GEN - 1a",{"$f":"'Vetting sheet'!E16","v":0}]
[null,null,{"$f":"IF('Vetting sheet'!E16=\"\",\"\",\"LIST\")","v":""}]
[null,"GEN - 1b",{"$f":"'Vetting sheet'!E17","v":0}]
[null,null,{"$f":"IF('Vetting sheet'!E17=\"\",\"\",\"LIST\")","v":""}]
[null,"GEN - 1c",{"$f":"'Vetting sheet'!E18","v":0}]
[null,null,{"$f":"IF('Vetting sheet'!E18=\"\",\"\",\"LIST\")","v":""}]
[null,"SIT - 2a",{"$f":"'Vetting sheet'!E20","v":0}]
[null,null,{"$f":"IF('Vetting sheet'!E20=\"\",\"\",\"LIST\")","v":""}]
[null,"SIT - 2b",{"$f":"'Vetting sheet'!E21","v":0}]
[null,null,{"$f":"IF('Vetting sheet'!E21=\"\",\"\",\"LIST\")","v":""}]
[null,"DEM - 3a",{"$f":"'Vetting sheet'!$E$23","v":0}]
[null,null,{"$f":"IF('Vetting sheet'!E23=\"\",\"\",\"LIST\")","v":""}]
[null,"DEM - 4a",{"$f":"'Vetting sheet'!E25","v":0}]
[null,null,{"$f":"IF('Vetting sheet'!E25=\"\",\"\",\"LIST\")","v":""}]
[null,"DEM - 4b",{"$f":"'Vetting sheet'!E26","v":0}]
[null,null,{"$f":"IF('Vetting sheet'!E26=\"\",\"\",\"LIST\")","v":""}]
[null,"SER - 5a",{"$f":"'Vetting sheet'!E28","v":0}]
[null,null,{"$f":"IF('Vetting sheet'!E28=\"\",\"\",\"LIST\")","v":""}]
[null,"SER - 5b",{"$f":"'Vetting sheet'!E29","v":0}]
[null,null,{"$f":"IF('Vetting sheet'!E29=\"\",\"\",\"LIST\")","v":""}]
[null,"SER - 5c",{"$f":"'Vetting sheet'!E30","v":0}]
[null,null,{"$f":"IF('Vetting sheet'!E30=\"\",\"\",\"LIST\")","v":""}]
[null,"SER - 5d",{"$f":"'Vetting sheet'!E31","v":0}]
[null,null,{"$f":"IF('Vetting sheet'!E31=\"\",\"\",\"LIST\")","v":""}]
[null,"SER - 5e",{"$f":"'Vetting sheet'!E32","v":0}]
[null,null,{"$f":"IF('Vetting sheet'!E32=\"\",\"\",\"LIST\")","v":""}]
[null,"SER - 5f",{"$f":"'Vetting sheet'!E33","v":0}]
[null,null,{"$f":"IF('Vetting sheet'!E33=\"\",\"\",\"LIST\")","v":""}]
[null,"SER - 5g",{"$f":"'Vetting sheet'!E34","v":0}]
[null,null,{"$f":"IF('Vetting sheet'!E34=\"\",\"\",\"LIST\")","v":""}]
[null,"SER - 5h",{"$f":"'Vetting sheet'!E35","v":0}]
[null,null,{"$f":"IF('Vetting sheet'!E35=\"\",\"\",\"LIST\")","v":""}]
[null,"FOU - 6a",{"$f":"'Vetting sheet'!E37","v":0}]
[null,null,{"$f":"IF('Vetting sheet'!E37=\"\",\"\",\"LIST\")","v":""}]
[null,"FOU - 6b",{"$f":"'Vetting sheet'!E38","v":0}]
[null,null,{"$f":"IF('Vetting sheet'!E38=\"\",\"\",\"LIST\")","v":""}]
[null,"CON - 7a",{"$f":"'Vetting sheet'!E40","v":0}]
[null,null,{"$f":"IF('Vetting sheet'!E40=\"\",\"\",\"LIST\")","v":""}]
[null,"CON - 7b",{"$f":"'Vetting sheet'!E41","v":0}]
[null,null,{"$f":"IF('Vetting sheet'!E41=\"\",\"\",\"LIST\")","v":""}]
[null,"CON - 7c",{"$f":"'Vetting sheet'!E42","v":0}]
[null,null,{"$f":"IF('Vetting sheet'!E42=\"\",\"\",\"LIST\")","v":""}]
[null,"CON - 7d",{"$f":"'Vetting sheet'!E43","v":0}]
[null,null,{"$f":"IF('Vetting sheet'!E43=\"\",\"\",\"LIST\")","v":""}]
[null,"CON - 7e",{"$f":"'Vetting sheet'!E44","v":0}]
[null,null,{"$f":"IF('Vetting sheet'!E44=\"\",\"\",\"LIST\")","v":""}]
[null,"CON - 7f",{"$f":"'Vetting sheet'!E45","v":0}]
[null,null,{"$f":"IF('Vetting sheet'!E45=\"\",\"\",\"LIST\")","v":""}]
[null,"CON - 7g",{"$f":"'Vetting sheet'!E46","v":0}]
[null,null,{"$f":"IF('Vetting sheet'!E46=\"\",\"\",\"LIST\")","v":""}]
[null,"CON - 7h",{"$f":"'Vetting sheet'!E47","v":0}]
[null,null,{"$f":"IF('Vetting sheet'!E47=\"\",\"\",\"LIST\")","v":""}]
[null,"CON - 7i",{"$f":"'Vetting sheet'!E48","v":0}]
[null,null,{"$f":"IF('Vetting sheet'!E48=\"\",\"\",\"LIST\")","v":""}]
[null,"CON - 7j",{"$f":"'Vetting sheet'!E49","v":0}]
[null,null,{"$f":"IF('Vetting sheet'!E49=\"\",\"\",\"LIST\")","v":""}]
[null,"STR - 8a",{"$f":"'Vetting sheet'!E51","v":0}]
[null,null,{"$f":"IF('Vetting sheet'!E51=\"\",\"\",\"LIST\")","v":""}]
[null,"STR - 8b",{"$f":"'Vetting sheet'!E52","v":0}]
[null,null,{"$f":"IF('Vetting sheet'!E52=\"\",\"\",\"LIST\")","v":""}]
[null,"STR - 8c",{"$f":"'Vetting sheet'!E53","v":0}]
[null,null,{"$f":"IF('Vetting sheet'!E53=\"\",\"\",\"LIST\")","v":""}]
[null,"STR - 8d",{"$f":"'Vetting sheet'!E54","v":0}]
[null,null,{"$f":"IF('Vetting sheet'!E54=\"\",\"\",\"LIST\")","v":""}]
[null,"EXT - 9a",{"$f":"'Vetting sheet'!E56","v":0}]
[null,null,{"$f":"IF('Vetting sheet'!E56=\"\",\"\",\"LIST\")","v":""}]
[null,"EXT - 9b",{"$f":"'Vetting sheet'!E57","v":0}]
[null,null,{"$f":"IF('Vetting sheet'!E57=\"\",\"\",\"LIST\")","v":""}]
[null,"EXT - 9c",{"$f":"'Vetting sheet'!E58","v":0}]
[null,null,{"$f":"IF('Vetting sheet'!E58=\"\",\"\",\"LIST\")","v":""}]
[null,"SPE - 10a",{"$f":"'Vetting sheet'!E60","v":0}]
[null,null,{"$f":"IF('Vetting sheet'!E60=\"\",\"\",\"LIST\")","v":""}]
[null,"CS - 11a",{"$f":"'Vetting sheet'!E62","v":0}]
[null,null,{"$f":"IF('Vetting sheet'!E62=\"\",\"\",\"LIST\")","v":""}]
[null,"ACC - 12a",{"$f":"'Vetting sheet'!$E$64","v":0}]
[null,null,{"$f":"IF('Vetting sheet'!E64=\"\",\"\",\"LIST\")","v":""}]
[null,"FIR - 13a",{"$f":"'Vetting sheet'!E66","v":0}]
[null,null,{"$f":"IF('Vetting sheet'!E66=\"\",\"\",\"LIST\")","v":""}]
[null,"FIR - 13b",{"$f":"'Vetting sheet'!E67","v":0}]
[null,null,{"$f":"IF('Vetting sheet'!E67=\"\",\"\",\"LIST\")","v":""}]
[null,"FIR - 13c",{"$f":"'Vetting sheet'!E68","v":0}]
[null,null,{"$f":"IF('Vetting sheet'!E68=\"\",\"\",\"LIST\")","v":""}]
[null,"EXB - 14a",{"$f":"'Vetting sheet'!E70","v":0}]
[null,null,{"$f":"IF('Vetting sheet'!E70=\"\",\"\",\"LIST\")","v":""}]
[null,"EXB - 14b",{"$f":"'Vetting sheet'!E71","v":0}]
[null,null,{"$f":"IF('Vetting sheet'!E71=\"\",\"\",\"LIST\")","v":""}]
[null,"EXB - 14c",{"$f":"'Vetting sheet'!E72","v":0}]
[null,null,{"$f":"IF('Vetting sheet'!E72=\"\",\"\",\"LIST\")","v":""}]
[null,"SOU - 15a",{"$f":"'Vetting sheet'!$E$74","v":0}]
[null,null,{"$f":"IF('Vetting sheet'!E74=\"\",\"\",\"LIST\")","v":""}]
[null,"COU - 16a",{"$f":"'Vetting sheet'!E76","v":0}]
[null,null,{"$f":"IF('Vetting sheet'!E76=\"\",\"\",\"LIST\")","v":""}]
[null,"COU - 16b",{"$f":"'Vetting sheet'!E77","v":0}]
[null,null,{"$f":"IF('Vetting sheet'!E77=\"\",\"\",\"LIST\")","v":""}]
[null,"COU - 16c",{"$f":"'Vetting sheet'!E78","v":0}]
[null,null,{"$f":"IF('Vetting sheet'!E78=\"\",\"\",\"LIST\")","v":""}]
[null,"COU - 16d",{"$f":"'Vetting sheet'!E79","v":0}]
[null,null,{"$f":"IF('Vetting sheet'!E79=\"\",\"\",\"LIST\")","v":""}]
[null,"COU - 16e",{"$f":"'Vetting sheet'!E80","v":0}]
[null,null,{"$f":"IF('Vetting sheet'!E80=\"\",\"\",\"LIST\")","v":""}]
[null,"HAZ - 17a",{"$f":"'Vetting sheet'!$E$82","v":0}]
[null,null,{"$f":"IF('Vetting sheet'!E82=\"\",\"\",\"LIST\")","v":""}]
[null,"HAZ - 18a",{"$f":"'Vetting sheet'!$E$84","v":0}]
[null,null,{"$f":"IF('Vetting sheet'!E84=\"\",\"\",\"LIST\")","v":""}]
[null,"FOO - 19a",{"$f":"'Vetting sheet'!$E$86","v":0}]
[null,null,{"$f":"IF('Vetting sheet'!E86=\"\",\"\",\"LIST\")","v":""}]
[null,"OTH - 20a",{"$f":"'Vetting sheet'!E88","v":0}]
[null,null,{"$f":"IF('Vetting sheet'!E88=\"\",\"\",\"LIST\")","v":""}]
[null,"OTH - 20b",{"$f":"'Vetting sheet'!E89","v":0}]
[null,null,{"$f":"IF('Vetting sheet'!E89=\"\",\"\",\"LIST\")","v":""}]
[null,"OTH - 20c",{"$f":"'Vetting sheet'!E90","v":0}]
[null,null,{"$f":"IF('Vetting sheet'!E90=\"\",\"\",\"LIST\")","v":""}]
[null,"OTH - 20d",{"$f":"'Vetting sheet'!E91","v":0}]
[null,null,{"$f":"IF('Vetting sheet'!E91=\"\",\"\",\"LIST\")","v":""}]
[null,"OTH - 20e",{"$f":"'Vetting sheet'!E92","v":0}]
[null,null,{"$f":"IF('Vetting sheet'!E92=\"\",\"\",\"LIST\")","v":""}]
[null,"OTH - 20f",{"$f":"'Vetting sheet'!E93","v":0}]
[null,null,{"$f":"IF('Vetting sheet'!E93=\"\",\"\",\"LIST\")","v":""}]
[null,"OTH - 20g",{"$f":"'Vetting sheet'!E94","v":0}]
[null,null,{"$f":"IF('Vetting sheet'!E94=\"\",\"\",\"LIST\")","v":""}]
[null,"OTH - 20h",{"$f":"'Vetting sheet'!E95","v":0}]
[null,null,{"$f":"IF('Vetting sheet'!E95=\"\",\"\",\"LIST\")","v":""}]
[null,"OTH - 20i",{"$f":"'Vetting sheet'!E96","v":0}]
[null,null,{"$f":"IF('Vetting sheet'!E96=\"\",\"\",\"LIST\")","v":""}]
[null,"OTH - 20j",{"$f":"'Vetting sheet'!E97","v":0}]
[]
[null,"If you wish to re-submit your application:\n• Use the Apply for building consent option at  http://onlineservices.ccc.govt.nz. If you are not already registered for Online Services, you can register for free at any time at  http://onlineservices.ccc.govt.nz.. For further information, see www.ccc.govt.nz/bcguide.\n• Alternatively, you can post or deliver your application to the address below. However, you can eliminate scanning fees, and reduce processing fees and delays, by submitting documents online.\n\nPlease do not lock or password-protect PDFs, as they have to be merged into final consent documents."]
[]
[null,"This letter is sent to the applicant and the owner, where possible."]
[]
[null,"Yours sincerely"]
[null,null,"Space "]
[null,null,"Space "]
[null,{"$f":"'Summary sheet'!E22","v":"Barjinder jit Singh"}]
[null,{"$f":"'Summary sheet'!E23","v":"Vetting Officer"}]

{"sheet":"B501a-Not accepted with invoice","index":12,"n_rows":153,"n_cols":16,"rows_kept":153,"cut":false,"hidden":false,"merged":[[8,4,8,5],[148,1,148,2],[12,1,12,2],[13,1,13,2],[15,1,15,2],[16,1,16,2],[144,1,144,2],[146,1,146,2],[9,1,9,2],[1,1,1,2],[3,1,3,2],[4,1,4,2],[5,1,5,2],[6,1,6,2]]}
[]
[null,{"$f":"TODAY()","v":"2017-08-20"},null,null,"Summary sheet","B501-Not accepted letter"]
[null,null,null,null,"Vetting sheet","B501a-Not accepted with invoice"]
[null,{"$f":"'Summary sheet'!E7","v":"Trevor Jones "},null,null,"B120-Processing sheet","Application update letter",null,null,null,null,null,null,null,null,null,"C/-"]
[null,{"$f":"'Summary sheet'!$E$9","v":"47 Second Avenue , Tauranga"},null,null,"B150-Structural specialist","B521-RFI letter"]
[null,{"$f":"'Summary sheet'!E10&\"\"","v":"Tauranga"},null,null,"B151a-Fire safety specialist","B529-Final reminder letter"]
[null,{"$f":"'Summary sheet'!$E$8","v":"trevor@architecturaldesigngroup.co.nz"},null,null,"B151b-Fire safety specialist","B532-Refusal letter"]
[null,null,null,null,"B160-PS specialist","S71-74 natural hazards"]
[null,null,null,null,"B462-Draft CS"]
[null,{"$f":"\"Dear\"&\" \"&'Summary sheet'!E11","v":"Dear Sir / Madam"}]
[]
[null,{"$f":"P12&\" \"&'Summary sheet'!E15","v":"Building Consent: BCN/2017/2013"},null,null,null,null,null,null,null,null,null,null,null,null,null,"Building Consent:"]
[null,{"$f":"'Summary sheet'!$E$16","v":"80 Byron Street Sydenham "},null,{"$f":"B13","v":"80 Byron Street Sydenham "}]
[null,{"$f":"'Summary sheet'!E17","v":"Addition to Factory - New Offices, Meeting and Store Room"},null,{"$f":"B14","v":"Addition to Factory - New Offices, Meeting and Store Room"}]
[]
[null,"Application Not Accepted"]
[null,"\nWe have completed a pre-acceptance technical check of your application. As the following information was not supplied, we are unable to accept your application:",null,{"$f":"B17","v":"\nWe have completed a pre-acceptance technical check of your application. As the following information was not supplied, we are unable to accept your application:"}]
[null,"\nCode\n","Missing information\n"]
[null,"GEN - 1a",{"$f":"'Vetting sheet'!E16","v":0}]
[null,null,{"$f":"IF('Vetting sheet'!E16=\"\",\"\",\"LIST\")","v":""}]
[null,"GEN - 1b",{"$f":"'Vetting sheet'!E17","v":0}]
[null,null,{"$f":"IF('Vetting sheet'!E17=\"\",\"\",\"LIST\")","v":""}]
[null,"GEN - 1c",{"$f":"'Vetting sheet'!E18","v":0}]
[null,null,{"$f":"IF('Vetting sheet'!E18=\"\",\"\",\"LIST\")","v":""}]
[null,"SIT - 2a",{"$f":"'Vetting sheet'!E20","v":0}]
[null,null,{"$f":"IF('Vetting sheet'!E20=\"\",\"\",\"LIST\")","v":""}]
[null,"SIT - 2b",{"$f":"'Vetting sheet'!E21","v":0}]
[null,null,{"$f":"IF('Vetting sheet'!E21=\"\",\"\",\"LIST\")","v":""}]
[null,"DEM - 3a",{"$f":"'Vetting sheet'!$E$23","v":0}]
[null,null,{"$f":"IF('Vetting sheet'!E23=\"\",\"\",\"LIST\")","v":""}]
[null,"DEM - 4a",{"$f":"'Vetting sheet'!E25","v":0}]
[null,null,{"$f":"IF('Vetting sheet'!E25=\"\",\"\",\"LIST\")","v":""}]
[null,"DEM - 4b",{"$f":"'Vetting sheet'!E26","v":0}]
[null,null,{"$f":"IF('Vetting sheet'!E26=\"\",\"\",\"LIST\")","v":""}]
[null,"SER - 5a",{"$f":"'Vetting sheet'!E28","v":0}]
[null,null,{"$f":"IF('Vetting sheet'!E28=\"\",\"\",\"LIST\")","v":""}]
[null,"SER - 5b",{"$f":"'Vetting sheet'!E29","v":0}]
[null,null,{"$f":"IF('Vetting sheet'!E29=\"\",\"\",\"LIST\")","v":""}]
[null,"SER - 5c",{"$f":"'Vetting sheet'!E30","v":0}]
[null,null,{"$f":"IF('Vetting sheet'!E30=\"\",\"\",\"LIST\")","v":""}]
[null,"SER - 5d",{"$f":"'Vetting sheet'!E31","v":0}]
[null,null,{"$f":"IF('Vetting sheet'!E31=\"\",\"\",\"LIST\")","v":""}]
[null,"SER - 5e",{"$f":"'Vetting sheet'!E32","v":0}]
[null,null,{"$f":"IF('Vetting sheet'!E32=\"\",\"\",\"LIST\")","v":""}]
[null,"SER - 5f",{"$f":"'Vetting sheet'!E33","v":0}]
[null,null,{"$f":"IF('Vetting sheet'!E33=\"\",\"\",\"LIST\")","v":""}]
[null,"SER - 5g",{"$f":"'Vetting sheet'!E34","v":0}]
[null,null,{"$f":"IF('Vetting sheet'!E34=\"\",\"\",\"LIST\")","v":""}]
[null,"SER - 5h",{"$f":"'Vetting sheet'!E35","v":0}]
[null,null,{"$f":"IF('Vetting sheet'!E35=\"\",\"\",\"LIST\")","v":""}]
[null,"FOU - 6a",{"$f":"'Vetting sheet'!E37","v":0}]
[null,null,{"$f":"IF('Vetting sheet'!E37=\"\",\"\",\"LIST\")","v":""}]
[null,"FOU - 6b",{"$f":"'Vetting sheet'!E38","v":0}]
[null,null,{"$f":"IF('Vetting sheet'!E38=\"\",\"\",\"LIST\")","v":""}]
[null,"CON - 7a",{"$f":"'Vetting sheet'!E40","v":0}]
[null,null,{"$f":"IF('Vetting sheet'!E40=\"\",\"\",\"LIST\")","v":""}]
[null,"CON - 7b",{"$f":"'Vetting sheet'!E41","v":0}]
[null,null,{"$f":"IF('Vetting sheet'!E41=\"\",\"\",\"LIST\")","v":""}]
[null,"CON - 7c",{"$f":"'Vetting sheet'!E42","v":0}]
[null,null,{"$f":"IF('Vetting sheet'!E42=\"\",\"\",\"LIST\")","v":""}]
[null,"CON - 7d",{"$f":"'Vetting sheet'!E43","v":0}]
[null,null,{"$f":"IF('Vetting sheet'!E43=\"\",\"\",\"LIST\")","v":""}]
[null,"CON - 7e",{"$f":"'Vetting sheet'!E44","v":0}]
[null,null,{"$f":"IF('Vetting sheet'!E44=\"\",\"\",\"LIST\")","v":""}]
[null,"CON - 7f",{"$f":"'Vetting sheet'!E45","v":0}]
[null,null,{"$f":"IF('Vetting sheet'!E45=\"\",\"\",\"LIST\")","v":""}]
[null,"CON - 7g",{"$f":"'Vetting sheet'!E46","v":0}]
[null,null,{"$f":"IF('Vetting sheet'!E46=\"\",\"\",\"LIST\")","v":""}]
[null,"CON - 7h",{"$f":"'Vetting sheet'!E47","v":0}]
[null,null,{"$f":"IF('Vetting sheet'!E47=\"\",\"\",\"LIST\")","v":""}]
[null,"CON - 7i",{"$f":"'Vetting sheet'!E48","v":0}]
[null,null,{"$f":"IF('Vetting sheet'!E48=\"\",\"\",\"LIST\")","v":""}]
[null,"CON - 7j",{"$f":"'Vetting sheet'!E49","v":0}]
[null,null,{"$f":"IF('Vetting sheet'!E49=\"\",\"\",\"LIST\")","v":""}]
[null,"STR - 8a",{"$f":"'Vetting sheet'!E51","v":0}]
[null,null,{"$f":"IF('Vetting sheet'!E51=\"\",\"\",\"LIST\")","v":""}]
[null,"STR - 8b",{"$f":"'Vetting sheet'!E52","v":0}]
[null,null,{"$f":"IF('Vetting sheet'!E52=\"\",\"\",\"LIST\")","v":""}]
[null,"STR - 8c",{"$f":"'Vetting sheet'!E53","v":0}]
[null,null,{"$f":"IF('Vetting sheet'!E53=\"\",\"\",\"LIST\")","v":""}]
[null,"STR - 8d",{"$f":"'Vetting sheet'!E54","v":0}]
[null,null,{"$f":"IF('Vetting sheet'!E54=\"\",\"\",\"LIST\")","v":""}]
[null,"EXT - 9a",{"$f":"'Vetting sheet'!E56","v":0}]
[null,null,{"$f":"IF('Vetting sheet'!E56=\"\",\"\",\"LIST\")","v":""}]
[null,"EXT - 9b",{"$f":"'Vetting sheet'!E57","v":0}]
[null,null,{"$f":"IF('Vetting sheet'!E57=\"\",\"\",\"LIST\")","v":""}]
[null,"EXT - 9c",{"$f":"'Vetting sheet'!E58","v":0}]
[null,null,{"$f":"IF('Vetting sheet'!E58=\"\",\"\",\"LIST\")","v":""}]
[null,"SPE - 10a",{"$f":"'Vetting sheet'!E60","v":0}]
[null,null,{"$f":"IF('Vetting sheet'!E60=\"\",\"\",\"LIST\")","v":""}]
[null,"CS - 11a",{"$f":"'Vetting sheet'!E62","v":0}]
[null,null,{"$f":"IF('Vetting sheet'!E62=\"\",\"\",\"LIST\")","v":""}]
[null,"ACC - 12a",{"$f":"'Vetting sheet'!$E$64","v":0}]
[null,null,{"$f":"IF('Vetting sheet'!E64=\"\",\"\",\"LIST\")","v":""}]
[null,"FIR - 13a",{"$f":"'Vetting sheet'!E66","v":0}]
[null,null,{"$f":"IF('Vetting sheet'!E66=\"\",\"\",\"LIST\")","v":""}]
[null,"FIR - 13b",{"$f":"'Vetting sheet'!E67","v":0}]
[null,null,{"$f":"IF('Vetting sheet'!E67=\"\",\"\",\"LIST\")","v":""}]
[null,"FIR - 13c",{"$f":"'Vetting sheet'!E68","v":0}]
[null,null,{"$f":"IF('Vetting sheet'!E68=\"\",\"\",\"LIST\")","v":""}]
[null,"EXB - 14a",{"$f":"'Vetting sheet'!E70","v":0}]
[null,null,{"$f":"IF('Vetting sheet'!E70=\"\",\"\",\"LIST\")","v":""}]
[null,"EXB - 14b",{"$f":"'Vetting sheet'!E71","v":0}]
[null,null,{"$f":"IF('Vetting sheet'!E71=\"\",\"\",\"LIST\")","v":""}]
[null,"EXB - 14c",{"$f":"'Vetting sheet'!E72","v":0}]
[null,null,{"$f":"IF('Vetting sheet'!E72=\"\",\"\",\"LIST\")","v":""}]
[null,"SOU - 15a",{"$f":"'Vetting sheet'!$E$74","v":0}]
[null,null,{"$f":"IF('Vetting sheet'!E74=\"\",\"\",\"LIST\")","v":""}]
[null,"COU - 16a",{"$f":"'Vetting sheet'!E76","v":0}]
[null,null,{"$f":"IF('Vetting sheet'!E76=\"\",\"\",\"LIST\")","v":""}]
[null,"COU - 16b",{"$f":"'Vetting sheet'!E77","v":0}]
[null,null,{"$f":"IF('Vetting sheet'!E77=\"\",\"\",\"LIST\")","v":""}]
[null,"COU - 16c",{"$f":"'Vetting sheet'!E78","v":0}]
[null,null,{"$f":"IF('Vetting sheet'!E78=\"\",\"\",\"LIST\")","v":""}]
[null,"COU - 16d",{"$f":"'Vetting sheet'!E79","v":0}]
[null,null,{"$f":"IF('Vetting sheet'!E79=\"\",\"\",\"LIST\")","v":""}]
[null,"COU - 16e",{"$f":"'Vetting sheet'!E80","v":0}]
[null,null,{"$f":"IF('Vetting sheet'!E80=\"\",\"\",\"LIST\")","v":""}]
[null,"HAZ - 17a",{"$f":"'Vetting sheet'!$E$82","v":0}]
[null,null,{"$f":"IF('Vetting sheet'!E82=\"\",\"\",\"LIST\")","v":""}]
[null,"HAZ - 18a",{"$f":"'Vetting sheet'!$E$84","v":0}]
[null,null,{"$f":"IF('Vetting sheet'!E84=\"\",\"\",\"LIST\")","v":""}]
[null,"FOO - 19a",{"$f":"'Vetting sheet'!$E$86","v":0}]
[null,null,{"$f":"IF('Vetting sheet'!E86=\"\",\"\",\"LIST\")","v":""}]
[null,"OTH - 20a",{"$f":"'Vetting sheet'!E88","v":0}]
[null,null,{"$f":"IF('Vetting sheet'!E88=\"\",\"\",\"LIST\")","v":""}]
[null,"OTH - 20b",{"$f":"'Vetting sheet'!E89","v":0}]
[null,null,{"$f":"IF('Vetting sheet'!E89=\"\",\"\",\"LIST\")","v":""}]
[null,"OTH - 20c",{"$f":"'Vetting sheet'!E90","v":0}]
[null,null,{"$f":"IF('Vetting sheet'!E90=\"\",\"\",\"LIST\")","v":""}]
[null,"OTH - 20d",{"$f":"'Vetting sheet'!E91","v":0}]
[null,null,{"$f":"IF('Vetting sheet'!E91=\"\",\"\",\"LIST\")","v":""}]
[null,"OTH - 20e",{"$f":"'Vetting sheet'!E92","v":0}]
[null,null,{"$f":"IF('Vetting sheet'!E92=\"\",\"\",\"LIST\")","v":""}]
[null,"OTH - 20f",{"$f":"'Vetting sheet'!E93","v":0}]
[null,null,{"$f":"IF('Vetting sheet'!E93=\"\",\"\",\"LIST\")","v":""}]
[null,"OTH - 20g",{"$f":"'Vetting sheet'!E94","v":0}]
[null,null,{"$f":"IF('Vetting sheet'!E94=\"\",\"\",\"LIST\")","v":""}]
[null,"OTH - 20h",{"$f":"'Vetting sheet'!E95","v":0}]
[null,null,{"$f":"IF('Vetting sheet'!E95=\"\",\"\",\"LIST\")","v":""}]
[null,"OTH - 20i",{"$f":"'Vetting sheet'!E96","v":0}]
[null,null,{"$f":"IF('Vetting sheet'!E96=\"\",\"\",\"LIST\")","v":""}]
[null,"OTH - 20j",{"$f":"'Vetting sheet'!E97","v":0}]
[]
[null,"Please find attached your invoice.\n\nYou can use internet banking to pay pre-acceptance fees. Please note that all payments will be credited to our account on the next business day. Any payment made without your details below may take some time to be lodged against the correct account. Our details are:\nBank: Bank of New Zealand\nAccount name: Christchurch City Council\nAccount number: 02 0800 0044765 03\n\nThe information that you need to enter that will help us identify your payment is:\nParticulars «Invoice_Number»\nCode 10-«Debtor_Number»«Debtor_Chk_Digit»\nReference «Payment_Reference»\n\nOnce you have made payment, please reply to this email, with proof of payment, to notify us. If you are paying more than one invoice, please send remittance advice to revenue@ccc.govt.nz.\n\nWhere an invoiced amount has not been paid by the stated due date, the Council may commence debt recovery action. The Council reserves the right to charge interest, payable from the date the debt became due, and recover costs incurred in pursuing recovery of the debt.\n\nIf you wish to re-submit your application:\n• Use the Apply for building consent option at  http://onlineservices.ccc.govt.nz. If you are not already registered for Online Services, you can register for free at any time at  http://onlineservices.ccc.govt.nz.. For further information, see www.ccc.govt.nz/bcguide.\n• Alternatively, you can post or deliver your application to the address below. However, you can eliminate scanning fees, and reduce processing fees and delays, by submitting documents online.\n\nPlease do not lock or password-protect PDFs, as they have to be merged into final consent documents."]
[]
[null,"This letter is sent to the applicant and the owner, where possible."]
[]
[null,"Yours sincerely"]
[null,null,"Space "]
[null,null,"Space "]
[null,{"$f":"'Summary sheet'!E22","v":"Barjinder jit Singh"}]
[null,{"$f":"'Summary sheet'!E23","v":"Vetting Officer"}]

{"sheet":"B529-Final reminder letter","index":13,"n_rows":610,"n_cols":14,"rows_kept":610,"cut":false,"hidden":false,"merged":[[8,5,8,6],[603,1,603,4],[604,1,604,2],[601,1,601,2],[12,1,12,3],[13,1,13,3],[16,1,17,4],[600,1,600,4],[602,1,602,4],[9,1,9,2],[1,1,1,2],[3,1,3,2],[4,1,4,2],[5,1,5,2],[6,1,6,2]]}
[]
[null,{"$f":"TODAY( )","v":"2017-08-20"},null,null,null,"Summary sheet","B501-Not accepted letter"]
[null,null,null,null,null,"Vetting sheet","B501a-Not accepted with invoice"]
[null,{"$f":"'Summary sheet'!$E$7","v":"Trevor Jones "},null,null,null,"B120-Processing sheet","Application update letter"]
[null,{"$f":"'Summary sheet'!E9","v":"47 Second Avenue , Tauranga"},null,null,null,"B150-Structural specialist","B521-RFI letter"]
[null,{"$f":"'Summary sheet'!$E$10","v":"Tauranga"},null,null,null,"B151a-Fire safety specialist","B529-Final reminder letter"]
[null,{"$f":"'Summary sheet'!E8","v":"trevor@architecturaldesigngroup.co.nz"},null,null,null,"B151b-Fire safety specialist","B532-Refusal letter"]
[null,"a","a",null,null,"B160-PS specialist","S71-74 natural hazards"]
[null,"a","a",null,null,"B462-Draft CS"]
[null,{"$f":"\"Dear\"&\" \"&'Summary sheet'!E11","v":"Dear Sir / Madam"}]
[null,"a","a"]
[null,{"$f":"'Summary sheet'!I15&\" \"&'Summary sheet'!E15","v":"Building Consent: BCN/2017/2013"}]
[null,{"$f":"'Summary sheet'!$E$16","v":"80 Byron Street Sydenham "},null,null,null,null,null,null,null,null,null,null,null,{"$f":"B13","v":"80 Byron Street Sydenham "}]
[null,{"$f":"'Summary sheet'!$E$17","v":"Addition to Factory - New Offices, Meeting and Store Room"},null,null,null,null,null,null,null,null,null,null,null,{"$f":"B14","v":"Addition to Factory - New Offices, Meeting and Store Room"}]
[null,"a","a"]
[null,"Request for information: final reminder"]
[null,"This is a final reminder that processing of your application has shown the need for further information as detailed below.\n"]
[]
[null,"a","a"]
[null,"RFI Code\n","RFI Items\n",null,"Status\n"]
[null,"GEN - 001",{"$f":"'B120-Processing sheet'!F15","v":0},null,{"$f":"'B120-Processing sheet'!G15","v":0}]
[null,null,{"$f":"IF('B120-Processing sheet'!F15=\"\",\"\",\"LIST\")","v":""}]
[null,"GEN - 001A",{"$f":"'B120-Processing sheet'!F16","v":0},null,{"$f":"'B120-Processing sheet'!G16","v":0}]
[null,null,{"$f":"IF('B120-Processing sheet'!F16=\"\",\"\",\"LIST\")","v":""}]
[null,"GEN - 001B",{"$f":"'B120-Processing sheet'!F17","v":0},null,{"$f":"'B120-Processing sheet'!G17","v":0}]
[null,null,{"$f":"IF('B120-Processing sheet'!F17=\"\",\"\",\"LIST\")","v":""}]
[null,"GEN - 002",{"$f":"'B120-Processing sheet'!F18","v":0},null,{"$f":"'B120-Processing sheet'!G18","v":0}]
[null,null,{"$f":"IF('B120-Processing sheet'!F18=\"\",\"\",\"LIST\")","v":""}]
[null,"GEN - 003",{"$f":"'B120-Processing sheet'!F19","v":0},null,{"$f":"'B120-Processing sheet'!G19","v":0}]
[null,null,{"$f":"IF('B120-Processing sheet'!F19=\"\",\"\",\"LIST\")","v":""}]
[null,"GEN - 004",{"$f":"'B120-Processing sheet'!F20","v":0},null,{"$f":"'B120-Processing sheet'!G20","v":0}]
[null,null,{"$f":"IF('B120-Processing sheet'!F20=\"\",\"\",\"LIST\")","v":""}]
[null,"GEN - 005",{"$f":"'B120-Processing sheet'!F21","v":0},null,{"$f":"'B120-Processing sheet'!G21","v":0}]
[null,null,{"$f":"IF('B120-Processing sheet'!F21=\"\",\"\",\"LIST\")","v":""}]
[null,"GEN - 006",{"$f":"'B120-Processing sheet'!F22","v":"Provide on the site plan, sufficient levels to establish compliance with [B1, E1, E2, G13, City Plan]. These should include new and existing finished floor levels and site levels to Christchurch Drainage Datum, including datum point location."},null,{"$f":"'B120-Processing sheet'!G22","v":"Resolved"}]
[null,null,{"$f":"IF('B120-Processing sheet'!F22=\"\",\"\",\"LIST\")","v":"LIST"}]
[null,"GEN - 007",{"$f":"'B120-Processing sheet'!F23","v":"Please indicate the location of the block wall on the site plan in relation to the boundary to demonstrate that this building will be constructed within the boundaries of the property (including foundations).\n\n13/07/07 - thank you for your response, however the survey plan suggests that the existing building may be constructed over the boundary. Please confirm that the addition will be constructed wholly within the boundaries of this property, note you will be required to supply a building location certificate at setout of the foundation to confirm that the addition is within the property boundary."},null,{"$f":"'B120-Processing sheet'!G23","v":"Resolved"}]
[null,null,{"$f":"IF('B120-Processing sheet'!F23=\"\",\"\",\"LIST\")","v":"LIST"}]
[null,"GEN - 008",{"$f":"'B120-Processing sheet'!F24","v":0},null,{"$f":"'B120-Processing sheet'!G24","v":0}]
[null,null,{"$f":"IF('B120-Processing sheet'!F24=\"\",\"\",\"LIST\")","v":""}]
[null,"GEN - 009",{"$f":"'B120-Processing sheet'!F25","v":0},null,{"$f":"'B120-Processing sheet'!G25","v":0}]
[null,null,{"$f":"IF('B120-Processing sheet'!F25=\"\",\"\",\"LIST\")","v":""}]
[null,"GEN - 010",{"$f":"'B120-Processing sheet'!F26","v":"Please provide a site specific sediment control plan taking into consideration any drainage outlets that may be existing on site hardstanding area."},null,{"$f":"'B120-Processing sheet'!G26","v":"Resolved"}]
[null,null,{"$f":"IF('B120-Processing sheet'!F26=\"\",\"\",\"LIST\")","v":"LIST"}]
[null,"GEN - 011",{"$f":"'B120-Processing sheet'!F27","v":0},null,{"$f":"'B120-Processing sheet'!G27","v":0}]
[null,null,{"$f":"IF('B120-Processing sheet'!F27=\"\",\"\",\"LIST\")","v":""}]
[null,"GEN - 012",{"$f":"'B120-Processing sheet'!F28","v":"Please provide schedule of construction monitoring that will be conducted by the structural engineer and confirm that a PS4 will be provided when construction complete."},null,{"$f":"'B120-Processing sheet'!G28","v":"Resolved"}]
[null,null,{"$f":"IF('B120-Processing sheet'!F28=\"\",\"\",\"LIST\")","v":"LIST"}]
[null,"BA - 013",{"$f":"'B120-Processing sheet'!F30","v":0},null,{"$f":"'B120-Processing sheet'!G30","v":0}]
[null,null,{"$f":"IF('B120-Processing sheet'!F30=\"\",\"\",\"LIST\")","v":""}]
[null,"B1 - 014",{"$f":"'B120-Processing sheet'!F32","v":0},null,{"$f":"'B120-Processing sheet'!G32","v":0}]
[null,null,{"$f":"IF('B120-Processing sheet'!F32=\"\",\"\",\"LIST\")","v":""}]
[null,"B1 - 015",{"$f":"'B120-Processing sheet'!F33","v":0},null,{"$f":"'B120-Processing sheet'!G33","v":0}]
[null,null,{"$f":"IF('B120-Processing sheet'!F33=\"\",\"\",\"LIST\")","v":""}]
[null,"B1 - 016",{"$f":"'B120-Processing sheet'!F34","v":"1. Please provide a copy of the structural engineering calculations to allow for assessment of compliance with the requirements of B1. RESOLVED\n\n2. Please provide details of how it is intended to connect the new walls to the existing external walls of the building sufficient to demonstrate compliance with requirements of B1 taking into consideration that the design features report indicates that the buildings will be seismically separated however the foundations have been tied together. RESOLVED\n\n3. The information available to Council indicates the presence of external metal structures that appear to be potentially providing additional structural support to the existing building. Please confirm if this is occuring and if so how will that structural element continue to be maintained when the new addition is added. RESOLVED\n\n4. Please provide detail demonstrating how the roof brace in connected to structural elements on Grid line 2 and the central SHS post on Gridline 1 sufficient to demonstrate compliance with the requirements of B1. RESOLVED\n\n5. Please provide documentation to demonstrate that the lateral stability of the stack bond block walls has been achieved sufficient to demonstrate compliance with B1. RESOLVED\n\n6. Please provide a bracing plan and calculations sufficient to demonstrate compliance with the requirements of B1. RESOLVED\n\n7. The lintel above the sliding door appears to be specific design. Please provide documentation to support the size of the lintel indicated in detail 17 sheet A16. RESOLVED\n\n8. The drawings indicate that the opening in the existing wall will be significantly extended. Please provide details of the support for this opening and evidence that the bracing of the existing building can be maintained with this new opening.\n\n14/07/17 - Unable to locate information within engineering calculations as indicated - please direct me to where this information is located."},null,{"$f":"'B120-Processing sheet'!G34","v":"Resolved"}]
[null,null,{"$f":"IF('B120-Processing sheet'!F34=\"\",\"\",\"LIST\")","v":"LIST"}]
[null,"B1 - 017",{"$f":"'B120-Processing sheet'!F35","v":0},null,{"$f":"'B120-Processing sheet'!G35","v":0}]
[null,null,{"$f":"IF('B120-Processing sheet'!F35=\"\",\"\",\"LIST\")","v":""}]
[null,"B1 - 018",{"$f":"'B120-Processing sheet'!F36","v":0},null,{"$f":"'B120-Processing sheet'!G36","v":0}]
[null,null,{"$f":"IF('B120-Processing sheet'!F36=\"\",\"\",\"LIST\")","v":""}]
[null,"B1 - 019",{"$f":"'B120-Processing sheet'!F37","v":0},null,{"$f":"'B120-Processing sheet'!G37","v":0}]
[null,null,{"$f":"IF('B120-Processing sheet'!F37=\"\",\"\",\"LIST\")","v":""}]
[null,"B1 - 020",{"$f":"'B120-Processing sheet'!F38","v":"As this project involves connection with the existing building please provide a Detailed Engineering Evaluation (DEE) for the existing building.\n\n13/07/17 - Your response refers to a report by Holmes Consulting, however no report was received"},null,{"$f":"'B120-Processing sheet'!G38","v":"Resolved"}]
[null,null,{"$f":"IF('B120-Processing sheet'!F38=\"\",\"\",\"LIST\")","v":"LIST"}]
[null,"B1 - 021",{"$f":"'B120-Processing sheet'!F39","v":0},null,{"$f":"'B120-Processing sheet'!G39","v":0}]
[null,null,{"$f":"IF('B120-Processing sheet'!F39=\"\",\"\",\"LIST\")","v":""}]
[null,"B1 - 022",{"$f":"'B120-Processing sheet'!F41","v":0},null,{"$f":"'B120-Processing sheet'!G41","v":0}]
[null,null,{"$f":"IF('B120-Processing sheet'!F41=\"\",\"\",\"LIST\")","v":""}]
[null,"B1 - 023",{"$f":"'B120-Processing sheet'!F42","v":0},null,{"$f":"'B120-Processing sheet'!G42","v":0}]
[null,null,{"$f":"IF('B120-Processing sheet'!F42=\"\",\"\",\"LIST\")","v":""}]
[null,"B1 - 024",{"$f":"'B120-Processing sheet'!F43","v":0},null,{"$f":"'B120-Processing sheet'!G43","v":0}]
[null,null,{"$f":"IF('B120-Processing sheet'!F43=\"\",\"\",\"LIST\")","v":""}]
[null,"B1 - 025",{"$f":"'B120-Processing sheet'!F44","v":0},null,{"$f":"'B120-Processing sheet'!G44","v":0}]
[null,null,{"$f":"IF('B120-Processing sheet'!F44=\"\",\"\",\"LIST\")","v":""}]
[null,"B1 - 026",{"$f":"'B120-Processing sheet'!F45","v":0},null,{"$f":"'B120-Processing sheet'!G45","v":0}]
[null,null,{"$f":"IF('B120-Processing sheet'!F45=\"\",\"\",\"LIST\")","v":""}]
[null,"B1 - 027",{"$f":"'B120-Processing sheet'!F46","v":0},null,{"$f":"'B120-Processing sheet'!G46","v":0}]
[null,null,{"$f":"IF('B120-Processing sheet'!F46=\"\",\"\",\"LIST\")","v":""}]
[null,"B1 - 028",{"$f":"'B120-Processing sheet'!F47","v":0},null,{"$f":"'B120-Processing sheet'!G47","v":0}]
[null,null,{"$f":"IF('B120-Processing sheet'!F47=\"\",\"\",\"LIST\")","v":""}]
[null,"B1 - 029",{"$f":"'B120-Processing sheet'!F48","v":0},null,{"$f":"'B120-Processing sheet'!G48","v":0}]
[null,null,{"$f":"IF('B120-Processing sheet'!F48=\"\",\"\",\"LIST\")","v":""}]
[null,"B1 - 030",{"$f":"'B120-Processing sheet'!F49","v":0},null,{"$f":"'B120-Processing sheet'!G49","v":0}]
[null,null,{"$f":"IF('B120-Processing sheet'!F49=\"\",\"\",\"LIST\")","v":""}]
[null,"B1 - 031",{"$f":"'B120-Processing sheet'!F50","v":0},null,{"$f":"'B120-Processing sheet'!G50","v":0}]
[null,null,{"$f":"IF('B120-Processing sheet'!F50=\"\",\"\",\"LIST\")","v":""}]
[null,"B1 - 032",{"$f":"'B120-Processing sheet'!F51","v":0},null,{"$f":"'B120-Processing sheet'!G51","v":0}]
[null,null,{"$f":"IF('B120-Processing sheet'!F51=\"\",\"\",\"LIST\")","v":""}]
[null,"B1 - 033",{"$f":"'B120-Processing sheet'!F52","v":0},null,{"$f":"'B120-Processing sheet'!G52","v":0}]
[null,null,{"$f":"IF('B120-Processing sheet'!F52=\"\",\"\",\"LIST\")","v":""}]
[null,"B1 - 034",{"$f":"'B120-Processing sheet'!F53","v":0},null,{"$f":"'B120-Processing sheet'!G53","v":0}]
[null,null,{"$f":"IF('B120-Processing sheet'!F53=\"\",\"\",\"LIST\")","v":""}]
[null,"B1 - 035",{"$f":"'B120-Processing sheet'!F54","v":0},null,{"$f":"'B120-Processing sheet'!G54","v":0}]
[null,null,{"$f":"IF('B120-Processing sheet'!F54=\"\",\"\",\"LIST\")","v":""}]
[null,"B1 - 036",{"$f":"'B120-Processing sheet'!F55","v":0},null,{"$f":"'B120-Processing sheet'!G55","v":0}]
[null,null,{"$f":"IF('B120-Processing sheet'!F55=\"\",\"\",\"LIST\")","v":""}]
[null,"B1 - 037",{"$f":"'B120-Processing sheet'!F56","v":0},null,{"$f":"'B120-Processing sheet'!G56","v":0}]
[null,null,{"$f":"IF('B120-Processing sheet'!F56=\"\",\"\",\"LIST\")","v":""}]
[null,"B1 - 038",{"$f":"'B120-Processing sheet'!F57","v":0},null,{"$f":"'B120-Processing sheet'!G57","v":0}]
[null,null,{"$f":"IF('B120-Processing sheet'!F57=\"\",\"\",\"LIST\")","v":""}]
[null,"B1 - 039",{"$f":"'B120-Processing sheet'!F58","v":0},null,{"$f":"'B120-Processing sheet'!G58","v":0}]
[null,null,{"$f":"IF('B120-Processing sheet'!F58=\"\",\"\",\"LIST\")","v":""}]
[null,"B1 - 040",{"$f":"'B120-Processing sheet'!F59","v":0},null,{"$f":"'B120-Processing sheet'!G59","v":0}]
[null,null,{"$f":"IF('B120-Processing sheet'!F59=\"\",\"\",\"LIST\")","v":""}]
[null,"B1 - 041",{"$f":"'B120-Processing sheet'!F60","v":0},null,{"$f":"'B120-Processing sheet'!G60","v":0}]
[null,null,{"$f":"IF('B120-Processing sheet'!F60=\"\",\"\",\"LIST\")","v":""}]
[null,"B1 - 042",{"$f":"'B120-Processing sheet'!F61","v":0},null,{"$f":"'B120-Processing sheet'!G61","v":0}]
[null,null,{"$f":"IF('B120-Processing sheet'!F61=\"\",\"\",\"LIST\")","v":""}]
[null,"B1 - 043",{"$f":"'B120-Processing sheet'!F62","v":0},null,{"$f":"'B120-Processing sheet'!G62","v":0}]
[null,null,{"$f":"IF('B120-Processing sheet'!F62=\"\",\"\",\"LIST\")","v":""}]
[null,"B1 - 044",{"$f":"'B120-Processing sheet'!F63","v":0},null,{"$f":"'B120-Processing sheet'!G63","v":0}]
[null,null,{"$f":"IF('B120-Processing sheet'!F63=\"\",\"\",\"LIST\")","v":""}]
[null,"B1 - 045",{"$f":"'B120-Processing sheet'!F64","v":0},null,{"$f":"'B120-Processing sheet'!G64","v":0}]
[null,null,{"$f":"IF('B120-Processing sheet'!F64=\"\",\"\",\"LIST\")","v":""}]
[null,"B1 - 046",{"$f":"'B120-Processing sheet'!F65","v":0},null,{"$f":"'B120-Processing sheet'!G65","v":0}]
[null,null,{"$f":"IF('B120-Processing sheet'!F65=\"\",\"\",\"LIST\")","v":""}]
[null,"B1 - 047",{"$f":"'B120-Processing sheet'!F66","v":0},null,{"$f":"'B120-Processing sheet'!G66","v":0}]
[null,null,{"$f":"IF('B120-Processing sheet'!F66=\"\",\"\",\"LIST\")","v":""}]
[null,"B1 - 048",{"$f":"'B120-Processing sheet'!F67","v":0},null,{"$f":"'B120-Processing sheet'!G67","v":0}]
[null,null,{"$f":"IF('B120-Processing sheet'!F67=\"\",\"\",\"LIST\")","v":""}]
[null,"B1 - 049",{"$f":"'B120-Processing sheet'!F68","v":"Please review the internal wall framing spacings taking into consideration the wall height of 2.7m. 90x45 @ 600mm centres does not meet the requirements of Table 8.2 NZS3604:2011."},null,{"$f":"'B120-Processing sheet'!G68","v":"Resolved"}]
[null,null,{"$f":"IF('B120-Processing sheet'!F68=\"\",\"\",\"LIST\")","v":"LIST"}]
[null,"B1 - 050",{"$f":"'B120-Processing sheet'!F69","v":0},null,{"$f":"'B120-Processing sheet'!G69","v":0}]
[null,null,{"$f":"IF('B120-Processing sheet'!F69=\"\",\"\",\"LIST\")","v":""}]
[null,"B1 - 051",{"$f":"'B120-Processing sheet'!F70","v":0},null,{"$f":"'B120-Processing sheet'!G70","v":0}]
[null,null,{"$f":"IF('B120-Processing sheet'!F70=\"\",\"\",\"LIST\")","v":""}]
[null,"B1 - 052",{"$f":"'B120-Processing sheet'!F71","v":0},null,{"$f":"'B120-Processing sheet'!G71","v":0}]
[null,null,{"$f":"IF('B120-Processing sheet'!F71=\"\",\"\",\"LIST\")","v":""}]
[null,"B1 - 053",{"$f":"'B120-Processing sheet'!F72","v":0},null,{"$f":"'B120-Processing sheet'!G72","v":0}]
[null,null,{"$f":"IF('B120-Processing sheet'!F72=\"\",\"\",\"LIST\")","v":""}]
[null,"B1 - 054",{"$f":"'B120-Processing sheet'!F73","v":0},null,{"$f":"'B120-Processing sheet'!G73","v":0}]
[null,null,{"$f":"IF('B120-Processing sheet'!F73=\"\",\"\",\"LIST\")","v":""}]
[null,"B1 - 055",{"$f":"'B120-Processing sheet'!F74","v":"Detail 11 sheet A15 indicates the presence of outriggers please provide sufficient details to demonstrate compliance with B1. A roof framing plan may be appropriate which includes length of outrigger over hang and the support for the metal roofing at the eave."},null,{"$f":"'B120-Processing sheet'!G74","v":"Resolved"}]
[null,null,{"$f":"IF('B120-Processing sheet'!F74=\"\",\"\",\"LIST\")","v":"LIST"}]
[null,"B1 - 056",{"$f":"'B120-Processing sheet'!F75","v":0},null,{"$f":"'B120-Processing sheet'!G75","v":0}]
[null,null,{"$f":"IF('B120-Processing sheet'!F75=\"\",\"\",\"LIST\")","v":""}]
[null,"B1 - 057",{"$f":"'B120-Processing sheet'!F76","v":0},null,{"$f":"'B120-Processing sheet'!G76","v":0}]
[null,null,{"$f":"IF('B120-Processing sheet'!F76=\"\",\"\",\"LIST\")","v":""}]
[null,"B1 - 058",{"$f":"'B120-Processing sheet'!F77","v":0},null,{"$f":"'B120-Processing sheet'!G77","v":0}]
[null,null,{"$f":"IF('B120-Processing sheet'!F77=\"\",\"\",\"LIST\")","v":""}]
[null,"B1 - 059",{"$f":"'B120-Processing sheet'!F78","v":0},null,{"$f":"'B120-Processing sheet'!G78","v":0}]
[null,null,{"$f":"IF('B120-Processing sheet'!F78=\"\",\"\",\"LIST\")","v":""}]
[null,"B1 - 060",{"$f":"'B120-Processing sheet'!F79","v":0},null,{"$f":"'B120-Processing sheet'!G79","v":0}]
[null,null,{"$f":"IF('B120-Processing sheet'!F79=\"\",\"\",\"LIST\")","v":""}]
[null,"B1 - 061",{"$f":"'B120-Processing sheet'!F80","v":0},null,{"$f":"'B120-Processing sheet'!G80","v":0}]
[null,null,{"$f":"IF('B120-Processing sheet'!F80=\"\",\"\",\"LIST\")","v":""}]
[null,"B1 - 062",{"$f":"'B120-Processing sheet'!F81","v":0},null,{"$f":"'B120-Processing sheet'!G81","v":0}]
[null,null,{"$f":"IF('B120-Processing sheet'!F81=\"\",\"\",\"LIST\")","v":""}]
[null,"B2 - 063",{"$f":"'B120-Processing sheet'!F83","v":0},null,{"$f":"'B120-Processing sheet'!G83","v":0}]
[null,null,{"$f":"IF('B120-Processing sheet'!F83=\"\",\"\",\"LIST\")","v":""}]
[null,"B2 - 064",{"$f":"'B120-Processing sheet'!F84","v":"Please provide finished floor level for the addition. Whilst it is noted that the building does not need to meet the requirements of E1, it will be required to achieve compliance with 50 year durability requirements. As the internal of the building consistents of structural elements which are susceptible to the impact of moisture please provide details of how it is intended to ensure the structural integrity of these elements.\n\n13/07/17 - thank you for the revised detail for the internal walls, however it has been noted there is a timber external wall which provides some structural support and will also require protection. Please review/revise as appropriate."},null,{"$f":"'B120-Processing sheet'!G84","v":"Resolved"}]
[null,null,{"$f":"IF('B120-Processing sheet'!F84=\"\",\"\",\"LIST\")","v":"LIST"}]
[null,"B2 - 065",{"$f":"'B120-Processing sheet'!F85","v":0},null,{"$f":"'B120-Processing sheet'!G85","v":0}]
[null,null,{"$f":"IF('B120-Processing sheet'!F85=\"\",\"\",\"LIST\")","v":""}]
[null,"B2 - 066",{"$f":"'B120-Processing sheet'!F86","v":0},null,{"$f":"'B120-Processing sheet'!G86","v":0}]
[null,null,{"$f":"IF('B120-Processing sheet'!F86=\"\",\"\",\"LIST\")","v":""}]
[null,"B2 - 067",{"$f":"'B120-Processing sheet'!F87","v":0},null,{"$f":"'B120-Processing sheet'!G87","v":0}]
[null,null,{"$f":"IF('B120-Processing sheet'!F87=\"\",\"\",\"LIST\")","v":""}]
[null,"B2 - 068",{"$f":"'B120-Processing sheet'!F88","v":0},null,{"$f":"'B120-Processing sheet'!G88","v":0}]
[null,null,{"$f":"IF('B120-Processing sheet'!F88=\"\",\"\",\"LIST\")","v":""}]
[null,"C1 - 069",{"$f":"'B120-Processing sheet'!F90","v":0},null,{"$f":"'B120-Processing sheet'!G90","v":0}]
[null,null,{"$f":"IF('B120-Processing sheet'!F90=\"\",\"\",\"LIST\")","v":""}]
[null,"D1 – 070",{"$f":"'B120-Processing sheet'!F92","v":0},null,{"$f":"'B120-Processing sheet'!G92","v":0}]
[null,null,{"$f":"IF('B120-Processing sheet'!F92=\"\",\"\",\"LIST\")","v":""}]
[null,"D1 – 071",{"$f":"'B120-Processing sheet'!F93","v":0},null,{"$f":"'B120-Processing sheet'!G93","v":0}]
[null,null,{"$f":"IF('B120-Processing sheet'!F93=\"\",\"\",\"LIST\")","v":""}]
[null,"D1 – 072",{"$f":"'B120-Processing sheet'!F94","v":0},null,{"$f":"'B120-Processing sheet'!G94","v":0}]
[null,null,{"$f":"IF('B120-Processing sheet'!F94=\"\",\"\",\"LIST\")","v":""}]
[null,"D1 – 073",{"$f":"'B120-Processing sheet'!F95","v":0},null,{"$f":"'B120-Processing sheet'!G95","v":0}]
[null,null,{"$f":"IF('B120-Processing sheet'!F95=\"\",\"\",\"LIST\")","v":""}]
[null,"D1 – 074",{"$f":"'B120-Processing sheet'!F96","v":"1. Please provide finished floor level between the existing and new floors sufficient to demonstrate compliance with the requirement of D1 in relation to isolated steps. RESOLVED\n\n2. Please review detail 18 sheet A16. The installation of the channel drain 100mm below the finished floor level and also door sill indicates the presence of an isolated step at this entrance which does not comply with the requirements of D1.\n\n13/07/17 - Thank you for the revised detail, however the dimensions provide are not within the scope of D1/AS1 4.1.1 and figure 11 ie risers of less than 150mm (less than 23 degree pitch) are not acceptable - Please review as appropriate. For this to be reviewed as an alterntive solution sufficient information to demonstrate compliance with D1 will be required.\n\n02/08/17 - Thank you for the details, however as you have indicated two risers please provide the details of the handrail sufficient to demonstrate compliance with the requirements of D1.3.2(K)."},null,{"$f":"'B120-Processing sheet'!G96","v":"Resolved"}]
[null,null,{"$f":"IF('B120-Processing sheet'!F96=\"\",\"\",\"LIST\")","v":"LIST"}]
[null,"D1 – 075",{"$f":"'B120-Processing sheet'!F97","v":0},null,{"$f":"'B120-Processing sheet'!G97","v":0}]
[null,null,{"$f":"IF('B120-Processing sheet'!F97=\"\",\"\",\"LIST\")","v":""}]
[null,"D1 – 076",{"$f":"'B120-Processing sheet'!F98","v":0},null,{"$f":"'B120-Processing sheet'!G98","v":0}]
[null,null,{"$f":"IF('B120-Processing sheet'!F98=\"\",\"\",\"LIST\")","v":""}]
[null,"D1 – 077",{"$f":"'B120-Processing sheet'!F99","v":0},null,{"$f":"'B120-Processing sheet'!G99","v":0}]
[null,null,{"$f":"IF('B120-Processing sheet'!F99=\"\",\"\",\"LIST\")","v":""}]
[null,"D1 – 078",{"$f":"'B120-Processing sheet'!F100","v":"Please provide a sill detail for door indicated on the East side of the addition sufficient to demonstrate compliance with the requirements of D1 and E2 in relation to accessible route."},null,{"$f":"'B120-Processing sheet'!G100","v":"Resolved"}]
[null,null,{"$f":"IF('B120-Processing sheet'!F100=\"\",\"\",\"LIST\")","v":"LIST"}]
[null,"D1 – 079",{"$f":"'B120-Processing sheet'!F101","v":0},null,{"$f":"'B120-Processing sheet'!G101","v":0}]
[null,null,{"$f":"IF('B120-Processing sheet'!F101=\"\",\"\",\"LIST\")","v":""}]
[null,"D1 – 080",{"$f":"'B120-Processing sheet'!F102","v":0},null,{"$f":"'B120-Processing sheet'!G102","v":0}]
[null,null,{"$f":"IF('B120-Processing sheet'!F102=\"\",\"\",\"LIST\")","v":""}]
[null,"D1 – 081",{"$f":"'B120-Processing sheet'!F103","v":0},null,{"$f":"'B120-Processing sheet'!G103","v":0}]
[null,null,{"$f":"IF('B120-Processing sheet'!F103=\"\",\"\",\"LIST\")","v":""}]
[null,"D1 – 082",{"$f":"'B120-Processing sheet'!F104","v":0},null,{"$f":"'B120-Processing sheet'!G104","v":0}]
[null,null,{"$f":"IF('B120-Processing sheet'!F104=\"\",\"\",\"LIST\")","v":""}]
[null,"D1 – 083",{"$f":"'B120-Processing sheet'!F105","v":0},null,{"$f":"'B120-Processing sheet'!G105","v":0}]
[null,null,{"$f":"IF('B120-Processing sheet'!F105=\"\",\"\",\"LIST\")","v":""}]
[null,"D1 – 084",{"$f":"'B120-Processing sheet'!F106","v":0},null,{"$f":"'B120-Processing sheet'!G106","v":0}]
[null,null,{"$f":"IF('B120-Processing sheet'!F106=\"\",\"\",\"LIST\")","v":""}]
[null,"D1 – 085",{"$f":"'B120-Processing sheet'!F107","v":0},null,{"$f":"'B120-Processing sheet'!G107","v":0}]
[null,null,{"$f":"IF('B120-Processing sheet'!F107=\"\",\"\",\"LIST\")","v":""}]
[null,"D2 – 086",{"$f":"'B120-Processing sheet'!F109","v":0},null,{"$f":"'B120-Processing sheet'!G109","v":0}]
[null,null,{"$f":"IF('B120-Processing sheet'!F109=\"\",\"\",\"LIST\")","v":""}]
[null,"D2 – 087",{"$f":"'B120-Processing sheet'!F110","v":0},null,{"$f":"'B120-Processing sheet'!G110","v":0}]
[null,null,{"$f":"IF('B120-Processing sheet'!F110=\"\",\"\",\"LIST\")","v":""}]
[null,"E1 – 088",{"$f":"'B120-Processing sheet'!F112","v":0},null,{"$f":"'B120-Processing sheet'!G112","v":0}]
[null,null,{"$f":"IF('B120-Processing sheet'!F112=\"\",\"\",\"LIST\")","v":""}]
[null,"E1 – 089",{"$f":"'B120-Processing sheet'!F113","v":"Please provide FFL and the ground to  floor separation. 13/07/2017 Resolved See TRIM 17/741973"},null,{"$f":"'B120-Processing sheet'!G113","v":"Resolved"}]
[null,null,{"$f":"IF('B120-Processing sheet'!F113=\"\",\"\",\"LIST\")","v":"LIST"}]
[null,"E1 – 090",{"$f":"'B120-Processing sheet'!F114","v":"• Authorisation For The Discharge Of Stormwater Into CCC Network: To comply with the New Zealand Building Code stormwater discharge from this property must avoid the likelihood of damage to the outfall in a manner acceptable to the Council’s Assets And Network Unit. In addition, the Council requires stormwater discharge compliance with Environment Canterbury’s regional rules and holds a number of discharge consents throughout its territory which it may use to authorise the discharge of stormwater into its network. Compliance with relevant consent conditions may require onsite stormwater mitigation (treatment and/or attenuation/disposal). Before a Building Consent can be issued you must seek authorisation from Council’s Assets And Network Unit by contacting Stormwater.Approvals@ccc.govt.nz. If Council does not authorise the stormwater discharge under one of its global consents, separate authorisation from Environment Canterbury may be required prior to a Building Consent being issued. The obtained authorisation must be included with the supporting documents of your building consent application.  13/07/2017 Resolved See TRIM 17/363256"},null,{"$f":"'B120-Processing sheet'!G114","v":"Resolved"}]
[null,null,{"$f":"IF('B120-Processing sheet'!F114=\"\",\"\",\"LIST\")","v":"LIST"}]
[null,"E1 – 091",{"$f":"'B120-Processing sheet'!F115","v":"Please provide the grade and pipe size  of the existing stormwater pipe to be disconnected so that the adequacy of the proposed design draining the additional proposed building can be ascertained. In addition please provide the pipe grade of the proposed stormwater pipe on drawing A4. 13/07/2017 Resolved See TRIM 17/741973"},null,{"$f":"'B120-Processing sheet'!G115","v":"Resolved"}]
[null,null,{"$f":"IF('B120-Processing sheet'!F115=\"\",\"\",\"LIST\")","v":"LIST"}]
[null,"E1 – 092",{"$f":"'B120-Processing sheet'!F116","v":0},null,{"$f":"'B120-Processing sheet'!G116","v":0}]
[null,null,{"$f":"IF('B120-Processing sheet'!F116=\"\",\"\",\"LIST\")","v":""}]
[null,"E1 – 093",{"$f":"'B120-Processing sheet'!F117","v":0},null,{"$f":"'B120-Processing sheet'!G117","v":0}]
[null,null,{"$f":"IF('B120-Processing sheet'!F117=\"\",\"\",\"LIST\")","v":""}]
[null,"E1 – 094",{"$f":"'B120-Processing sheet'!F118","v":0},null,{"$f":"'B120-Processing sheet'!G118","v":0}]
[null,null,{"$f":"IF('B120-Processing sheet'!F118=\"\",\"\",\"LIST\")","v":""}]
[null,"E1 – 095",{"$f":"'B120-Processing sheet'!F119","v":"Please provide the size of the proposed overflows on drawing A19  13/07/2017 Resolved See TRIM 17/741973"},null,{"$f":"'B120-Processing sheet'!G119","v":"Resolved"}]
[null,null,{"$f":"IF('B120-Processing sheet'!F119=\"\",\"\",\"LIST\")","v":"LIST"}]
[null,"E2 – 096",{"$f":"'B120-Processing sheet'!F121","v":0},null,{"$f":"'B120-Processing sheet'!G121","v":0}]
[null,null,{"$f":"IF('B120-Processing sheet'!F121=\"\",\"\",\"LIST\")","v":""}]
[null,"E2 – 097",{"$f":"'B120-Processing sheet'!F122","v":0},null,{"$f":"'B120-Processing sheet'!G122","v":0}]
[null,null,{"$f":"IF('B120-Processing sheet'!F122=\"\",\"\",\"LIST\")","v":""}]
[null,"E2 – 098",{"$f":"'B120-Processing sheet'!F123","v":"Please note on elevations the surface finish for the blockwalls sufficient to demonstrate compliance with the requirements of E2."},null,{"$f":"'B120-Processing sheet'!G123","v":"Resolved"}]
[null,null,{"$f":"IF('B120-Processing sheet'!F123=\"\",\"\",\"LIST\")","v":"LIST"}]
[null,"E2 – 099",{"$f":"'B120-Processing sheet'!F124","v":0},null,{"$f":"'B120-Processing sheet'!G124","v":0}]
[null,null,{"$f":"IF('B120-Processing sheet'!F124=\"\",\"\",\"LIST\")","v":""}]
[null,"E2 – 100",{"$f":"'B120-Processing sheet'!F125","v":"1. Please provide cladding details for all junctions sufficient to demonstrate compliance with requirements of E2. This should include but is not limited to the vertical metal cladding to blockwall both vertical junction and internal corner and internal corner for existing metal cladding to new block wall. RESOLVED\n\n2. If it is intended to have the new element structurally seismically separate from the existing building (as identified in the structural engineers design features report), please provide details for the junctions between the new and existing walls sufficient to demonstrate compliance with the requirements of E2.\n\n13/07/17 - Thank you for the additional details. Please review detail 23 Sheet A22. It appears the existing metal wall cladding is shown as continuous within the seismic gap required. Also Detail 24 same sheet indicates the presence of blocking within this seismic gap. Please remove from details to ensure full depth of seismic separation is maintained. RESOLVED\n\n13/07/17 - NEW - please provide a detail for the junction between existing block wall and new blockwall located on the boundary - this detail should reflect the requirement for seismic separation that has been indicated throughout consent documents. Note detail 7 will need to be revised to reflect this requirement and to remove the metal cladding indicated within the seismic gap.\n\n02/08/17 - Thank you for the details provided, however please review detail 28 sheet A22. The gap between the new and existing blockwall is shown to be only 10mm, whereas there is a requirement for 50mm seismic separation. As these are both structural elements the 50mm separation is required to be maintained in this location. Note that as the gap will now exceed 0.1m² (3.5x0.050m) this gap will need to be firerated to the same rating as the wall which is shown to be 120 minute FRR."},null,{"$f":"'B120-Processing sheet'!G125","v":"Resolved"}]
[null,null,{"$f":"IF('B120-Processing sheet'!F125=\"\",\"\",\"LIST\")","v":"LIST"}]
[null,"E2 – 101",{"$f":"'B120-Processing sheet'!F126","v":0},null,{"$f":"'B120-Processing sheet'!G126","v":0}]
[null,null,{"$f":"IF('B120-Processing sheet'!F126=\"\",\"\",\"LIST\")","v":""}]
[null,"E2 – 102",{"$f":"'B120-Processing sheet'!F128","v":0},null,{"$f":"'B120-Processing sheet'!G128","v":0}]
[null,null,{"$f":"IF('B120-Processing sheet'!F128=\"\",\"\",\"LIST\")","v":""}]
[null,"E2 – 103",{"$f":"'B120-Processing sheet'!F129","v":"1. Please provide apron flashing detail for where existing vertical metal wall cladding junctions with new metal roof cladding sufficient to demonstrate compliance with the requirements of E2 and taking into consideration the seismic separation of the new and existing building if appropriate.\n\n2. Please provide rainwater head penetration detail sufficient to demonstrate compliance with the requirements of E2.\n\n3. The North elevation indicates the potential for a clash between the existing external steel (braced) poles and the eave to the east elevation. Please provide sufficient detail to demonstrate compliance with the requirements of E2 at this location."},null,{"$f":"'B120-Processing sheet'!G129","v":"Resolved"}]
[null,null,{"$f":"IF('B120-Processing sheet'!F129=\"\",\"\",\"LIST\")","v":"LIST"}]
[null,"E2 – 104",{"$f":"'B120-Processing sheet'!F130","v":"1. Please provide wall to soffit junction for the raking soffit (greater than 90 degree eave) sufficient to demonstrate compliance with the requirements of E2.\n\n2. Please provide barge detail for junction with both blockwall and vertical metal wall cladding sufficient to demonstrate compliance with the requirements of E2."},null,{"$f":"'B120-Processing sheet'!G130","v":"Resolved"}]
[null,null,{"$f":"IF('B120-Processing sheet'!F130=\"\",\"\",\"LIST\")","v":"LIST"}]
[null,"E2 – 105",{"$f":"'B120-Processing sheet'!F131","v":0},null,{"$f":"'B120-Processing sheet'!G131","v":0}]
[null,null,{"$f":"IF('B120-Processing sheet'!F131=\"\",\"\",\"LIST\")","v":""}]
[null,"E2 – 106",{"$f":"'B120-Processing sheet'!F132","v":0},null,{"$f":"'B120-Processing sheet'!G132","v":0}]
[null,null,{"$f":"IF('B120-Processing sheet'!F132=\"\",\"\",\"LIST\")","v":""}]
[null,"E2 – 107",{"$f":"'B120-Processing sheet'!F133","v":0},null,{"$f":"'B120-Processing sheet'!G133","v":0}]
[null,null,{"$f":"IF('B120-Processing sheet'!F133=\"\",\"\",\"LIST\")","v":""}]
[null,"E2 – 108",{"$f":"'B120-Processing sheet'!F134","v":"Please provide internal gutter detail which indicates extent and all material layers sufficient to demonstrate compliance with the requirements of E2."},null,{"$f":"'B120-Processing sheet'!G134","v":"Resolved"}]
[null,null,{"$f":"IF('B120-Processing sheet'!F134=\"\",\"\",\"LIST\")","v":"LIST"}]
[null,"E2 – 109",{"$f":"'B120-Processing sheet'!F135","v":"1. Please review skylight penetration detail A sheet A20. It appears to reflect skylight located near roof edge (barge) which is not applicable for this application. The drawings appear to suggest the use of a diverter/cricket flashing which there has been no details provided.\n\n2. Please provide pipe roof penetration detail for the terminal vent pentration indicated on sheet A19 sufficient to demonstrate compliance with the requirements of E2."},null,{"$f":"'B120-Processing sheet'!G135","v":"Resolved"}]
[null,null,{"$f":"IF('B120-Processing sheet'!F135=\"\",\"\",\"LIST\")","v":"LIST"}]
[null,"E2 – 110",{"$f":"'B120-Processing sheet'!F136","v":0},null,{"$f":"'B120-Processing sheet'!G136","v":0}]
[null,null,{"$f":"IF('B120-Processing sheet'!F136=\"\",\"\",\"LIST\")","v":""}]
[null,"E2 – 111",{"$f":"'B120-Processing sheet'!F137","v":0},null,{"$f":"'B120-Processing sheet'!G137","v":0}]
[null,null,{"$f":"IF('B120-Processing sheet'!F137=\"\",\"\",\"LIST\")","v":""}]
[null,"E2 – 112",{"$f":"'B120-Processing sheet'!F138","v":0},null,{"$f":"'B120-Processing sheet'!G138","v":0}]
[null,null,{"$f":"IF('B120-Processing sheet'!F138=\"\",\"\",\"LIST\")","v":""}]
[null,"E2 – 113",{"$f":"'B120-Processing sheet'!F139","v":0},null,{"$f":"'B120-Processing sheet'!G139","v":0}]
[null,null,{"$f":"IF('B120-Processing sheet'!F139=\"\",\"\",\"LIST\")","v":""}]
[null,"E2 – 114",{"$f":"'B120-Processing sheet'!F140","v":"1. Please confirm that the membrane extends beyond the blockwall window sill sufficient to demonstrate compliance with the requirements of E2.\n\n2. Please review the head flashing detail for the block wall penetrations sufficient to demonstrate compliance with the requirements of E2. ie no drip edge provided."},null,{"$f":"'B120-Processing sheet'!G140","v":"Resolved"}]
[null,null,{"$f":"IF('B120-Processing sheet'!F140=\"\",\"\",\"LIST\")","v":"LIST"}]
[null,"E2 – 115",{"$f":"'B120-Processing sheet'!F141","v":0},null,{"$f":"'B120-Processing sheet'!G141","v":0}]
[null,null,{"$f":"IF('B120-Processing sheet'!F141=\"\",\"\",\"LIST\")","v":""}]
[null,"E3 – 116",{"$f":"'B120-Processing sheet'!F143","v":0},null,{"$f":"'B120-Processing sheet'!G143","v":0}]
[null,null,{"$f":"IF('B120-Processing sheet'!F143=\"\",\"\",\"LIST\")","v":""}]
[null,"E3 – 117",{"$f":"'B120-Processing sheet'!F144","v":0},null,{"$f":"'B120-Processing sheet'!G144","v":0}]
[null,null,{"$f":"IF('B120-Processing sheet'!F144=\"\",\"\",\"LIST\")","v":""}]
[null,"E3 – 118",{"$f":"'B120-Processing sheet'!F145","v":0},null,{"$f":"'B120-Processing sheet'!G145","v":0}]
[null,null,{"$f":"IF('B120-Processing sheet'!F145=\"\",\"\",\"LIST\")","v":""}]
[null,"E3 – 119",{"$f":"'B120-Processing sheet'!F146","v":0},null,{"$f":"'B120-Processing sheet'!G146","v":0}]
[null,null,{"$f":"IF('B120-Processing sheet'!F146=\"\",\"\",\"LIST\")","v":""}]
[null,"F1 – 120",{"$f":"'B120-Processing sheet'!F148","v":0},null,{"$f":"'B120-Processing sheet'!$G$148","v":0}]
[null,null,{"$f":"IF('B120-Processing sheet'!F148=\"\",\"\",\"LIST\")","v":""}]
[null,"F2 – 121",{"$f":"'B120-Processing sheet'!F150","v":0},null,{"$f":"'B120-Processing sheet'!G150","v":0}]
[null,null,{"$f":"IF('B120-Processing sheet'!F150=\"\",\"\",\"LIST\")","v":""}]
[null,"F2 – 122",{"$f":"'B120-Processing sheet'!F151","v":"Please confirm the presence of manifestation to glazing panels capable of being mistaken for an unimpeded path sufficient to demonstrate compliance with the requirements of F2 ie side panels for sliding doors."},null,{"$f":"'B120-Processing sheet'!G151","v":"Resolved"}]
[null,null,{"$f":"IF('B120-Processing sheet'!F151=\"\",\"\",\"LIST\")","v":"LIST"}]
[null,"F2 – 123",{"$f":"'B120-Processing sheet'!F152","v":0},null,{"$f":"'B120-Processing sheet'!G152","v":0}]
[null,null,{"$f":"IF('B120-Processing sheet'!F152=\"\",\"\",\"LIST\")","v":""}]
[null,"F3 – 124",{"$f":"'B120-Processing sheet'!F154","v":"Please advise if it is intended to store or use any hazardous substances within this new building element, if so please provide sufficient documentation to demonstrate compliance with the requirements of F3."},null,{"$f":"'B120-Processing sheet'!G154","v":"Resolved"}]
[null,null,{"$f":"IF('B120-Processing sheet'!F154=\"\",\"\",\"LIST\")","v":"LIST"}]
[null,"F3 – 125",{"$f":"'B120-Processing sheet'!F155","v":0},null,{"$f":"'B120-Processing sheet'!G155","v":0}]
[null,null,{"$f":"IF('B120-Processing sheet'!F155=\"\",\"\",\"LIST\")","v":""}]
[null,"F4 – 126",{"$f":"'B120-Processing sheet'!F157","v":0},null,{"$f":"'B120-Processing sheet'!G157","v":0}]
[null,null,{"$f":"IF('B120-Processing sheet'!F157=\"\",\"\",\"LIST\")","v":""}]
[null,"F4 – 127",{"$f":"'B120-Processing sheet'!F158","v":0},null,{"$f":"'B120-Processing sheet'!G158","v":0}]
[null,null,{"$f":"IF('B120-Processing sheet'!F158=\"\",\"\",\"LIST\")","v":""}]
[null,"F4 – 128",{"$f":"'B120-Processing sheet'!F159","v":0},null,{"$f":"'B120-Processing sheet'!G159","v":0}]
[null,null,{"$f":"IF('B120-Processing sheet'!F159=\"\",\"\",\"LIST\")","v":""}]
[null,"F5 – 129",{"$f":"'B120-Processing sheet'!F161","v":"Council records indicate the presence of other properties (businesses) within this complex which are likely to continue operating during the construction of the addition. Please provide details of barriers that will be provided to protect the public and restrict access sufficient to demonstrate compliance with the requirements of F5.\n\n13/07/17 - thank you for the response, however there is insufficient information to demonstrate protection of the public during works. Please show on drawings the presence of barrier fencing sufficient to prevent public access to site during construction."},null,{"$f":"'B120-Processing sheet'!$G$161","v":"Resolved"}]
[null,null,{"$f":"IF('B120-Processing sheet'!F161=\"\",\"\",\"LIST\")","v":"LIST"}]
[null,"F6 – 130",{"$f":"'B120-Processing sheet'!F163","v":0},null,{"$f":"'B120-Processing sheet'!$G$163","v":0}]
[null,null,{"$f":"IF('B120-Processing sheet'!F163=\"\",\"\",\"LIST\")","v":""}]
[null,"F7 – 131",{"$f":"'B120-Processing sheet'!F165","v":0},null,{"$f":"'B120-Processing sheet'!$G$165","v":0}]
[null,null,{"$f":"IF('B120-Processing sheet'!F165=\"\",\"\",\"LIST\")","v":""}]
[null,"F8 – 132",{"$f":"'B120-Processing sheet'!F167","v":0},null,{"$f":"'B120-Processing sheet'!G167","v":0}]
[null,null,{"$f":"IF('B120-Processing sheet'!F167=\"\",\"\",\"LIST\")","v":""}]
[null,"F8 – 133",{"$f":"'B120-Processing sheet'!F168","v":0},null,{"$f":"'B120-Processing sheet'!G168","v":0}]
[null,null,{"$f":"IF('B120-Processing sheet'!F168=\"\",\"\",\"LIST\")","v":""}]
[null,"F8 – 134",{"$f":"'B120-Processing sheet'!F169","v":0},null,{"$f":"'B120-Processing sheet'!G169","v":0}]
[null,null,{"$f":"IF('B120-Processing sheet'!F169=\"\",\"\",\"LIST\")","v":""}]
[null,"G1 – 135",{"$f":"'B120-Processing sheet'!F171","v":0},null,{"$f":"'B120-Processing sheet'!G171","v":0}]
[null,null,{"$f":"IF('B120-Processing sheet'!F171=\"\",\"\",\"LIST\")","v":""}]
[null,"G1 – 136",{"$f":"'B120-Processing sheet'!F172","v":0},null,{"$f":"'B120-Processing sheet'!G172","v":0}]
[null,null,{"$f":"IF('B120-Processing sheet'!F172=\"\",\"\",\"LIST\")","v":""}]
[null,"G1 – 137",{"$f":"'B120-Processing sheet'!F173","v":0},null,{"$f":"'B120-Processing sheet'!G173","v":0}]
[null,null,{"$f":"IF('B120-Processing sheet'!F173=\"\",\"\",\"LIST\")","v":""}]
[null,"G1 – 138",{"$f":"'B120-Processing sheet'!F174","v":0},null,{"$f":"'B120-Processing sheet'!G174","v":0}]
[null,null,{"$f":"IF('B120-Processing sheet'!F174=\"\",\"\",\"LIST\")","v":""}]
[null,"G2 – 139",{"$f":"'B120-Processing sheet'!F176","v":0},null,{"$f":"'B120-Processing sheet'!$G$176","v":0}]
[null,null,{"$f":"IF('B120-Processing sheet'!F176=\"\",\"\",\"LIST\")","v":""}]
[null,"G3 – 140",{"$f":"'B120-Processing sheet'!F178","v":0},null,{"$f":"'B120-Processing sheet'!G178","v":0}]
[null,null,{"$f":"IF('B120-Processing sheet'!F178=\"\",\"\",\"LIST\")","v":""}]
[null,"G3 – 141",{"$f":"'B120-Processing sheet'!F179","v":0},null,{"$f":"'B120-Processing sheet'!G179","v":0}]
[null,null,{"$f":"IF('B120-Processing sheet'!F179=\"\",\"\",\"LIST\")","v":""}]
[null,"G3 – 142",{"$f":"'B120-Processing sheet'!F180","v":0},null,{"$f":"'B120-Processing sheet'!G180","v":0}]
[null,null,{"$f":"IF('B120-Processing sheet'!F180=\"\",\"\",\"LIST\")","v":""}]
[null,"G3 – 143",{"$f":"'B120-Processing sheet'!F181","v":0},null,{"$f":"'B120-Processing sheet'!G181","v":0}]
[null,null,{"$f":"IF('B120-Processing sheet'!F181=\"\",\"\",\"LIST\")","v":""}]
[null,"G3 – 144",{"$f":"'B120-Processing sheet'!F182","v":0},null,{"$f":"'B120-Processing sheet'!G182","v":0}]
[null,null,{"$f":"IF('B120-Processing sheet'!F182=\"\",\"\",\"LIST\")","v":""}]
[null,"G4 – 145",{"$f":"'B120-Processing sheet'!F184","v":0},null,{"$f":"'B120-Processing sheet'!G184","v":0}]
[null,null,{"$f":"IF('B120-Processing sheet'!F184=\"\",\"\",\"LIST\")","v":""}]
[null,"G4 – 146",{"$f":"'B120-Processing sheet'!F185","v":0},null,{"$f":"'B120-Processing sheet'!G185","v":0}]
[null,null,{"$f":"IF('B120-Processing sheet'!F185=\"\",\"\",\"LIST\")","v":""}]
[null,"G4 – 147",{"$f":"'B120-Processing sheet'!F186","v":0},null,{"$f":"'B120-Processing sheet'!G186","v":0}]
[null,null,{"$f":"IF('B120-Processing sheet'!F186=\"\",\"\",\"LIST\")","v":""}]
[null,"G4 – 148",{"$f":"'B120-Processing sheet'!F187","v":0},null,{"$f":"'B120-Processing sheet'!G187","v":0}]
[null,null,{"$f":"IF('B120-Processing sheet'!F187=\"\",\"\",\"LIST\")","v":""}]
[null,"G4 – 149",{"$f":"'B120-Processing sheet'!F188","v":0},null,{"$f":"'B120-Processing sheet'!G188","v":0}]
[null,null,{"$f":"IF('B120-Processing sheet'!F188=\"\",\"\",\"LIST\")","v":""}]
[null,"G5 – 150",{"$f":"'B120-Processing sheet'!F190","v":0},null,{"$f":"'B120-Processing sheet'!G190","v":0}]
[null,null,{"$f":"IF('B120-Processing sheet'!F190=\"\",\"\",\"LIST\")","v":""}]
[null,"G5 – 151",{"$f":"'B120-Processing sheet'!F191","v":0},null,{"$f":"'B120-Processing sheet'!G191","v":0}]
[null,null,{"$f":"IF('B120-Processing sheet'!F191=\"\",\"\",\"LIST\")","v":""}]
[null,"G5 – 152",{"$f":"'B120-Processing sheet'!F192","v":0},null,{"$f":"'B120-Processing sheet'!G192","v":0}]
[null,null,{"$f":"IF('B120-Processing sheet'!F192=\"\",\"\",\"LIST\")","v":""}]
[null,"G6 – 153",{"$f":"'B120-Processing sheet'!F194","v":0},null,{"$f":"'B120-Processing sheet'!G194","v":0}]
[null,null,{"$f":"IF('B120-Processing sheet'!F194=\"\",\"\",\"LIST\")","v":""}]
[null,"G6 – 154",{"$f":"'B120-Processing sheet'!F195","v":0},null,{"$f":"'B120-Processing sheet'!G195","v":0}]
[null,null,{"$f":"IF('B120-Processing sheet'!F195=\"\",\"\",\"LIST\")","v":""}]
[null,"G7 – 155",{"$f":"'B120-Processing sheet'!F197","v":0},null,{"$f":"'B120-Processing sheet'!G197","v":0}]
[null,null,{"$f":"IF('B120-Processing sheet'!F197=\"\",\"\",\"LIST\")","v":""}]
[null,"G7 – 156",{"$f":"'B120-Processing sheet'!F198","v":0},null,{"$f":"'B120-Processing sheet'!G198","v":0}]
[null,null,{"$f":"IF('B120-Processing sheet'!F198=\"\",\"\",\"LIST\")","v":""}]
[null,"G8 – 157",{"$f":"'B120-Processing sheet'!F200","v":0},null,{"$f":"'B120-Processing sheet'!G200","v":0}]
[null,null,{"$f":"IF('B120-Processing sheet'!F200=\"\",\"\",\"LIST\")","v":""}]
[null,"G9 – 158",{"$f":"'B120-Processing sheet'!F202","v":0},null,{"$f":"'B120-Processing sheet'!G202","v":0}]
[null,null,{"$f":"IF('B120-Processing sheet'!F202=\"\",\"\",\"LIST\")","v":""}]
[null,"G9 – 159",{"$f":"'B120-Processing sheet'!F203","v":0},null,{"$f":"'B120-Processing sheet'!G203","v":0}]
[null,null,{"$f":"IF('B120-Processing sheet'!F203=\"\",\"\",\"LIST\")","v":""}]
[null,"G9 – 160",{"$f":"'B120-Processing sheet'!F204","v":0},null,{"$f":"'B120-Processing sheet'!G204","v":0}]
[null,null,{"$f":"IF('B120-Processing sheet'!F204=\"\",\"\",\"LIST\")","v":""}]
[null,"G10 - 161",{"$f":"'B120-Processing sheet'!F206","v":0},null,{"$f":"'B120-Processing sheet'!G206","v":0}]
[null,null,{"$f":"IF('B120-Processing sheet'!F206=\"\",\"\",\"LIST\")","v":""}]
[null,"G10 - 162",{"$f":"'B120-Processing sheet'!F207","v":"Please revise the standard referenced on sheet A8 in relation to the gas supply. The current standard for gas installation is AS/NZS5601:2013."},null,{"$f":"'B120-Processing sheet'!G207","v":"Resolved"}]
[null,null,{"$f":"IF('B120-Processing sheet'!F207=\"\",\"\",\"LIST\")","v":"LIST"}]
[null,"G12 – 163",{"$f":"'B120-Processing sheet'!F209","v":0},null,{"$f":"'B120-Processing sheet'!G209","v":0}]
[null,null,{"$f":"IF('B120-Processing sheet'!F209=\"\",\"\",\"LIST\")","v":""}]
[null,"G12 – 164",{"$f":"'B120-Processing sheet'!F210","v":0},null,{"$f":"'B120-Processing sheet'!G210","v":0}]
[null,null,{"$f":"IF('B120-Processing sheet'!F210=\"\",\"\",\"LIST\")","v":""}]
[null,"G12 – 165",{"$f":"'B120-Processing sheet'!F211","v":"Council records show this property to be industrial, however there are no records indicating the presence of backflow prevention device. The Council waters department requires all commercial properties to have a backflow prevention device at the boundary to protect the network water supply. Installation of the backflow preventor requires a building consent. Please advise if you would like to increase to scope to include the installation of a backflow prevention device, if so all supporting documentation identifying type and model will also be required."},null,{"$f":"'B120-Processing sheet'!G211","v":"Resolved"}]
[null,null,{"$f":"IF('B120-Processing sheet'!F211=\"\",\"\",\"LIST\")","v":"LIST"}]
[null,"G12 – 166",{"$f":"'B120-Processing sheet'!F212","v":0},null,{"$f":"'B120-Processing sheet'!G212","v":0}]
[null,null,{"$f":"IF('B120-Processing sheet'!F212=\"\",\"\",\"LIST\")","v":""}]
[null,"G12 – 167",{"$f":"'B120-Processing sheet'!F213","v":0},null,{"$f":"'B120-Processing sheet'!G213","v":0}]
[null,null,{"$f":"IF('B120-Processing sheet'!F213=\"\",\"\",\"LIST\")","v":""}]
[null,"G12 – 168",{"$f":"'B120-Processing sheet'!F214","v":0},null,{"$f":"'B120-Processing sheet'!G214","v":0}]
[null,null,{"$f":"IF('B120-Processing sheet'!F214=\"\",\"\",\"LIST\")","v":""}]
[null,"G12 – 169",{"$f":"'B120-Processing sheet'!F215","v":0},null,{"$f":"'B120-Processing sheet'!G215","v":0}]
[null,null,{"$f":"IF('B120-Processing sheet'!F215=\"\",\"\",\"LIST\")","v":""}]
[null,"G13 – 170",{"$f":"'B120-Processing sheet'!F217","v":"Please review the plumbing design taking into consideration that AS3500 requires all drains within slabs to be minimum of 65mm diameter."},null,{"$f":"'B120-Processing sheet'!G217","v":"Resolved"}]
[null,null,{"$f":"IF('B120-Processing sheet'!F217=\"\",\"\",\"LIST\")","v":"LIST"}]
[null,"G13 – 171",{"$f":"'B120-Processing sheet'!F218","v":"1. The plumbing plan indicates the presence of two existing inspection bends (IB) for the existing sewer pipe. Please review the requirement and if necessary provide sufficient details to demonstrate that these can be maintained to demonstrate compliance with the requirements of AS3500.\n\n2. Please review the location of inspection points for the existing wastewater connection - note at least one required outside the edge of building."},null,{"$f":"'B120-Processing sheet'!G218","v":"Resolved"}]
[null,null,{"$f":"IF('B120-Processing sheet'!F218=\"\",\"\",\"LIST\")","v":"LIST"}]
[null,"G13 – 172",{"$f":"'B120-Processing sheet'!F219","v":"Please provide sufficient information to demonstrate compliance with the requirements of AS3500 in relation to implications of trenches close to building and drains under buildings."},null,{"$f":"'B120-Processing sheet'!G219","v":"Resolved"}]
[null,null,{"$f":"IF('B120-Processing sheet'!F219=\"\",\"\",\"LIST\")","v":"LIST"}]
[null,"G13 – 173",{"$f":"'B120-Processing sheet'!F220","v":0},null,{"$f":"'B120-Processing sheet'!G220","v":0}]
[null,null,{"$f":"IF('B120-Processing sheet'!F220=\"\",\"\",\"LIST\")","v":""}]
[null,"G13 – 174",{"$f":"'B120-Processing sheet'!F221","v":0},null,{"$f":"'B120-Processing sheet'!G221","v":0}]
[null,null,{"$f":"IF('B120-Processing sheet'!F221=\"\",\"\",\"LIST\")","v":""}]
[null,"G13 – 175",{"$f":"'B120-Processing sheet'!F222","v":0},null,{"$f":"'B120-Processing sheet'!G222","v":0}]
[null,null,{"$f":"IF('B120-Processing sheet'!F222=\"\",\"\",\"LIST\")","v":""}]
[null,"G13 – 176",{"$f":"'B120-Processing sheet'!F223","v":0},null,{"$f":"'B120-Processing sheet'!G223","v":0}]
[null,null,{"$f":"IF('B120-Processing sheet'!F223=\"\",\"\",\"LIST\")","v":""}]
[null,"G14 – 177",{"$f":"'B120-Processing sheet'!F225","v":0},null,{"$f":"'B120-Processing sheet'!G225","v":0}]
[null,null,{"$f":"IF('B120-Processing sheet'!F225=\"\",\"\",\"LIST\")","v":""}]
[null,"G15 – 178",{"$f":"'B120-Processing sheet'!F227","v":0},null,{"$f":"'B120-Processing sheet'!G227","v":0}]
[null,null,{"$f":"IF('B120-Processing sheet'!F227=\"\",\"\",\"LIST\")","v":""}]
[null,"H1 – 179",{"$f":"'B120-Processing sheet'!F229","v":0},null,{"$f":"'B120-Processing sheet'!G229","v":0}]
[null,null,{"$f":"IF('B120-Processing sheet'!F229=\"\",\"\",\"LIST\")","v":""}]
[null,"H1 – 180",{"$f":"'B120-Processing sheet'!F230","v":"1. Please provide details of the extent of conditioned space for the new addition taking into consideration the opening between the new and existing building sufficient to demonstrate compliance with the requirements of H1.\n\n2. Please review the H1 calculations provided. The reference heat loss for the vertical glazing appears excessive in relation to the proposed vertical glazing."},null,{"$f":"'B120-Processing sheet'!G230","v":"Resolved"}]
[null,null,{"$f":"IF('B120-Processing sheet'!F230=\"\",\"\",\"LIST\")","v":"LIST"}]
[null,"H1 – 181",{"$f":"'B120-Processing sheet'!F231","v":0},null,{"$f":"'B120-Processing sheet'!G231","v":0}]
[null,null,{"$f":"IF('B120-Processing sheet'!F231=\"\",\"\",\"LIST\")","v":""}]
[null,"H1 – 182",{"$f":"'B120-Processing sheet'!F232","v":0},null,{"$f":"'B120-Processing sheet'!G232","v":0}]
[null,null,{"$f":"IF('B120-Processing sheet'!F232=\"\",\"\",\"LIST\")","v":""}]
[null,"CS - 183",{"$f":"'B120-Processing sheet'!F234","v":0},null,{"$f":"'B120-Processing sheet'!G234","v":0}]
[null,null,{"$f":"IF('B120-Processing sheet'!F234=\"\",\"\",\"LIST\")","v":""}]
[null,"CS  - 184",{"$f":"'B120-Processing sheet'!F235","v":0},null,{"$f":"'B120-Processing sheet'!G235","v":0}]
[null,null,{"$f":"IF('B120-Processing sheet'!F235=\"\",\"\",\"LIST\")","v":""}]
[null,"CM - 185",{"$f":"'B120-Processing sheet'!F237","v":0},null,{"$f":"'B120-Processing sheet'!G237","v":0}]
[null,null,{"$f":"IF('B120-Processing sheet'!F237=\"\",\"\",\"LIST\")","v":""}]
[null,"CM - 186",{"$f":"'B120-Processing sheet'!F238","v":0},null,{"$f":"'B120-Processing sheet'!G238","v":0}]
[null,null,{"$f":"IF('B120-Processing sheet'!F238=\"\",\"\",\"LIST\")","v":""}]
[null,"OT - 187",{"$f":"'B120-Processing sheet'!F240","v":0},null,{"$f":"'B120-Processing sheet'!G240","v":0}]
[null,null,{"$f":"IF('B120-Processing sheet'!F240=\"\",\"\",\"LIST\")","v":""}]
[null,"OT - 188",{"$f":"'B120-Processing sheet'!F241","v":0},null,{"$f":"'B120-Processing sheet'!G241","v":0}]
[null,null,{"$f":"IF('B120-Processing sheet'!F241=\"\",\"\",\"LIST\")","v":""}]
[null,"HAZ - 001",{"$f":"'S71-74 natural hazards'!$F$18","v":0},null,{"$f":"'S71-74 natural hazards'!$G$18","v":0}]
[null,null,{"$f":"IF('S71-74 natural hazards'!F18=\"\",\"\",\"LIST\")","v":""}]
[null,"HAZ - 002",{"$f":"'S71-74 natural hazards'!$F$19","v":0},null,{"$f":"'S71-74 natural hazards'!$G$19","v":0}]
[null,null,{"$f":"IF('S71-74 natural hazards'!F19=\"\",\"\",\"LIST\")","v":""}]
[null,"HAZ - 003",{"$f":"'S71-74 natural hazards'!$F$20","v":0},null,{"$f":"'S71-74 natural hazards'!$G$20","v":0}]
[null,null,{"$f":"IF('S71-74 natural hazards'!F20=\"\",\"\",\"LIST\")","v":""}]
[null,"HAZ - 004",{"$f":"'S71-74 natural hazards'!$F$21","v":0},null,{"$f":"'S71-74 natural hazards'!$G$21","v":0}]
[null,null,{"$f":"IF('S71-74 natural hazards'!F21=\"\",\"\",\"LIST\")","v":""}]
[null,"HAZ - 005",{"$f":"'S71-74 natural hazards'!$F$22","v":0},null,{"$f":"'S71-74 natural hazards'!$G$22","v":0}]
[null,null,{"$f":"IF('S71-74 natural hazards'!F22=\"\",\"\",\"LIST\")","v":""}]
[null,"HAZ - 006",{"$f":"'S71-74 natural hazards'!$F$23","v":0},null,{"$f":"'S71-74 natural hazards'!$G$23","v":0}]
[null,null,{"$f":"IF('S71-74 natural hazards'!F23=\"\",\"\",\"LIST\")","v":""}]
[null,"HAZ - 007",{"$f":"'S71-74 natural hazards'!$F$24","v":0},null,{"$f":"'S71-74 natural hazards'!$G$24","v":0}]
[null,null,{"$f":"IF('S71-74 natural hazards'!F24=\"\",\"\",\"LIST\")","v":""}]
[null,"HAZ - 008",{"$f":"'S71-74 natural hazards'!$F$25","v":0},null,{"$f":"'S71-74 natural hazards'!$G$25","v":0}]
[null,null,{"$f":"IF('S71-74 natural hazards'!F25=\"\",\"\",\"LIST\")","v":""}]
[null,"HAZ - 009",{"$f":"'S71-74 natural hazards'!$F$26","v":0},null,{"$f":"'S71-74 natural hazards'!$G$26","v":0}]
[null,null,{"$f":"IF('S71-74 natural hazards'!F26=\"\",\"\",\"LIST\")","v":""}]
[null,"HAZ - 010",{"$f":"'S71-74 natural hazards'!$F$27","v":0},null,{"$f":"'S71-74 natural hazards'!$G$27","v":0}]
[null,null,{"$f":"IF('S71-74 natural hazards'!F27=\"\",\"\",\"LIST\")","v":""}]
[null,null,{"$f":"IF('B150-Structural specialist '!F22=\"\",\"\",'B150-Structural specialist '!L28)","v":"Specialist Review : Geotechnical  (Margaret Stoffel)"}]
[null,"GEO - 001",{"$f":"'B150-Structural specialist '!F22","v":"a) please provide Engco geotechnical report for 83 Byron St. ADDED 13/7/17 report not provided; please provide ENGCO report. ADDED 31/7/17: Please provide results of CPT and CPTu site investigation. RESOLVED 15/8/17\n\na2) ADDED 31/7/17: The Engco report for 83 Byron St indicates potential liquefaction induced settlement up to 100mm for SLS and up to 165mm for ULS are possible. Please clarify that this has been considered in design of the slab footing for 80 Byron St extension. 15/8/17: WITHDRAWN\n\nb) Please compare foundation for existing building to the foundation for the proposed extension since the two will be structurally connected. WITHDRAWN  13/7/17\n\nc) Specification section 2.4.1 Excavation states: “Below slabs on ground the general intent is to excavate to a stable undisturbed subgrade (of 300kPa ultimate bearing capacity).” This is inconsistent with the PS1 and the geotechnical letter which indicate the foundation was designed for a safe bearing of 50kPa (which I understand to be equivalent to an ultimate bearing capacity of 150kPa which was recommended by the geotechnical letter). Please amend specification. RESOLVED 13/7/2013\n\nd) Specification section 2.4.1 Excavation also states “As soon as excavation and filling is complete foundation material will be inspected by the Architect…”. Please amend specification for foundation subgrade to be verified by the geotechnical engineer. RESOLVED 13/7/2013\n\ne) Specification section 2.4.2 Hardfill & Blinding states “Hardfill under slabs on grade shall be 150mm of standard TNZ AP40 basecourse…”  The geotechnical letter recommends a 300mm thick layer of AP65 below the concrete slab if placed on organic fill with UBC 150kPa, with geotextile (Bidim A19 or equal) on base & sides of excavation, geogrid (Cirtex Duragrid 30/30 or equal) over the textile; extending beyond the building footprint a distance equal to the depth of the gravel. Please address why geotechnical recommendations were not followed. RESOLVED 13/7/2013\n\n"},null,{"$f":"'B150-Structural specialist '!G22","v":"RESOLVED"}]
[null,null,{"$f":"IF('B150-Structural specialist '!F22=\"\",\"\",\"LIST\")","v":"LIST"}]
[null,"GEO - 001A",{"$f":"'B150-Structural specialist '!F23","v":"f) The geotechnical letter also recommends that where it is not possible to extend the gravel layer beyond the building footprint on the South & West sides of the building because the site boundary does not does not provide adequate space, a new slab section must be designed. Please address this issue. ADDED 13/7/17: Response revers to structural calculations; this does not answer the question. Please indicate where this information is found. 31/7/17: no response provided RESOLVED 15/8/17"},null,{"$f":"'B150-Structural specialist '!G23","v":0}]
[null,null,{"$f":"IF('B150-Structural specialist '!F23=\"\",\"\",\"LIST\")","v":"LIST"}]
[null,null,{"$f":"IF('B150-Structural specialist '!K39>1,'B150-Structural specialist '!M33,\"\")","v":""}]
[null,"STR -002",{"$f":"'B150-Structural specialist '!F25","v":0},null,{"$f":"'B150-Structural specialist '!G25","v":0}]
[null,null,{"$f":"IF('B150-Structural specialist '!F25=\"\",\"\",\"LIST\")","v":""}]
[null,"STR -003",{"$f":"'B150-Structural specialist '!F26","v":0},null,{"$f":"'B150-Structural specialist '!G26","v":0}]
[null,null,{"$f":"IF('B150-Structural specialist '!F26=\"\",\"\",\"LIST\")","v":""}]
[null,"STR -004",{"$f":"'B150-Structural specialist '!F27","v":0},null,{"$f":"'B150-Structural specialist '!G27","v":0}]
[null,null,{"$f":"IF('B150-Structural specialist '!F27=\"\",\"\",\"LIST\")","v":""}]
[null,"STR -005",{"$f":"'B150-Structural specialist '!F29","v":0},null,{"$f":"'B150-Structural specialist '!G29","v":0}]
[null,null,{"$f":"IF('B150-Structural specialist '!F29=\"\",\"\",\"LIST\")","v":""}]
[null,"STR -006",{"$f":"'B150-Structural specialist '!F31","v":0},null,{"$f":"'B150-Structural specialist '!G31","v":0}]
[null,null,{"$f":"IF('B150-Structural specialist '!F31=\"\",\"\",\"LIST\")","v":""}]
[null,"STR -007",{"$f":"'B150-Structural specialist '!F32","v":0},null,{"$f":"'B150-Structural specialist '!G32","v":0}]
[null,null,{"$f":"IF('B150-Structural specialist '!F32=\"\",\"\",\"LIST\")","v":""}]
[null,"STR -008",{"$f":"'B150-Structural specialist '!F33","v":0},null,{"$f":"'B150-Structural specialist '!G33","v":0}]
[null,null,{"$f":"IF('B150-Structural specialist '!F33=\"\",\"\",\"LIST\")","v":""}]
[null,"STR -009",{"$f":"'B150-Structural specialist '!F34","v":0},null,{"$f":"'B150-Structural specialist '!G34","v":0}]
[null,null,{"$f":"IF('B150-Structural specialist '!F34=\"\",\"\",\"LIST\")","v":""}]
[null,"STR -010",{"$f":"'B150-Structural specialist '!F36","v":0},null,{"$f":"'B150-Structural specialist '!G36","v":0}]
[null,null,{"$f":"IF('B150-Structural specialist '!F36=\"\",\"\",\"LIST\")","v":""}]
[null,"STR -010A",{"$f":"'B150-Structural specialist '!F37","v":0},null,{"$f":"'B150-Structural specialist '!G37","v":0}]
[null,null,{"$f":"IF('B150-Structural specialist '!F37=\"\",\"\",\"LIST\")","v":""}]
[null,null,{"$f":"IF('B151a-Fire safety specialist'!K72>1,'B151a-Fire safety specialist'!M70,\"\")","v":"Specialist Review : Fire  (Adrienne Slattery (Jonathan Nyman from 13/7/2017))"}]
[null,"FIR - 001",{"$f":"'B151a-Fire safety specialist'!F15","v":0},null,{"$f":"'B151a-Fire safety specialist'!G15","v":0}]
[null,null,{"$f":"IF('B151a-Fire safety specialist'!F15=\"\",\"\",\"LIST\")","v":""}]
[null,"FIR - 002",{"$f":"'B151a-Fire safety specialist'!F16","v":0},null,{"$f":"'B151a-Fire safety specialist'!G16","v":0}]
[null,null,{"$f":"IF('B151a-Fire safety specialist'!F16=\"\",\"\",\"LIST\")","v":""}]
[null,"FIR - 003",{"$f":"'B151a-Fire safety specialist'!F18","v":0},null,{"$f":"'B151a-Fire safety specialist'!G18","v":0}]
[null,null,{"$f":"IF('B151a-Fire safety specialist'!F18=\"\",\"\",\"LIST\")","v":""}]
[null,"FIR - 004",{"$f":"'B151a-Fire safety specialist'!F19","v":0},null,{"$f":"'B151a-Fire safety specialist'!G19","v":0}]
[null,null,{"$f":"IF('B151a-Fire safety specialist'!F19=\"\",\"\",\"LIST\")","v":""}]
[null,"FIR - 005",{"$f":"'B151a-Fire safety specialist'!F20","v":"The existing use listed on the compliance schedule is WL FHC2 and the building in part is provided with sprinkler coverage. Please reassess the building and update the fire report to reflect the change of use occuring and specified systems within the building. We cannot amend the compliance schedule without further information provided on the sprinkler system. \nADDED 13/7/2017 - Response noted.  As previously advised the existing Compliance Schedule (CS) states the building Purpose Group as WL, and that the building has some form of sprinkler protection.  The fire design proposes the building is to be used for workshop with storage to 3m which would change the use to WM Purpose Group. Consideration of such a Change of Use, and any building deletion of sprinklers from the CS and it's impact on neighbouring property protection as applicable is required."},null,{"$f":"'B151a-Fire safety specialist'!G20","v":"Resolved"}]
[null,null,{"$f":"IF('B151a-Fire safety specialist'!F20=\"\",\"\",\"LIST\")","v":"LIST"}]
[null,"FIR - 006",{"$f":"'B151a-Fire safety specialist'!F21","v":0},null,{"$f":"'B151a-Fire safety specialist'!G21","v":0}]
[null,null,{"$f":"IF('B151a-Fire safety specialist'!F21=\"\",\"\",\"LIST\")","v":""}]
[null,"FIR - 007",{"$f":"'B151a-Fire safety specialist'!F22","v":0},null,{"$f":"'B151a-Fire safety specialist'!G22","v":0}]
[null,null,{"$f":"IF('B151a-Fire safety specialist'!F22=\"\",\"\",\"LIST\")","v":""}]
[null,"FIR - 008",{"$f":"'B151a-Fire safety specialist'!F23","v":0},null,{"$f":"'B151a-Fire safety specialist'!G23","v":0}]
[null,null,{"$f":"IF('B151a-Fire safety specialist'!F23=\"\",\"\",\"LIST\")","v":""}]
[null,"FIR - 009",{"$f":"'B151a-Fire safety specialist'!F24","v":0},null,{"$f":"'B151a-Fire safety specialist'!G24","v":0}]
[null,null,{"$f":"IF('B151a-Fire safety specialist'!F24=\"\",\"\",\"LIST\")","v":""}]
[null,"FIR - 010",{"$f":"'B151a-Fire safety specialist'!F25","v":"As this application meets the criteria in NEW ZEALAND GAZETTE, No. 49  under 'Notice that Copies of Certain Applications for Building Consent Must be Provided to the New Zealand Fire Service Commission', the application has been sent to NZFS for them to provide a memorandum in accordance with section 47 of the Building Act. Once we receive their memorandum we will give regard to the memorandum and send to you for your response.\nADDED 21/04/2017 Please address the issues raised in the attached memo from the NZFS. \nADDED 13/7/2017 - Response to NZFS DRU memo, issued 21/4/2017, is still awaited. Memo is re-attached for use."},null,{"$f":"'B151a-Fire safety specialist'!G25","v":"Resolved"}]
[null,null,{"$f":"IF('B151a-Fire safety specialist'!F25=\"\",\"\",\"LIST\")","v":"LIST"}]
[null,"FIR - 011",{"$f":"'B151a-Fire safety specialist'!F26","v":0},null,{"$f":"'B151a-Fire safety specialist'!G26","v":0}]
[null,null,{"$f":"IF('B151a-Fire safety specialist'!F26=\"\",\"\",\"LIST\")","v":""}]
[null,"FIR - 012",{"$f":"'B151a-Fire safety specialist'!F28","v":0},null,{"$f":"'B151a-Fire safety specialist'!G28","v":0}]
[null,null,{"$f":"IF('B151a-Fire safety specialist'!F28=\"\",\"\",\"LIST\")","v":""}]
[null,"FIR - 013",{"$f":"'B151a-Fire safety specialist'!F29","v":0},null,{"$f":"'B151a-Fire safety specialist'!G29","v":0}]
[null,null,{"$f":"IF('B151a-Fire safety specialist'!F29=\"\",\"\",\"LIST\")","v":""}]
[null,"FIR - 014",{"$f":"'B151a-Fire safety specialist'!F30","v":0},null,{"$f":"'B151a-Fire safety specialist'!G30","v":0}]
[null,null,{"$f":"IF('B151a-Fire safety specialist'!F30=\"\",\"\",\"LIST\")","v":""}]
[null,"FIR - 015",{"$f":"'B151a-Fire safety specialist'!F31","v":0},null,{"$f":"'B151a-Fire safety specialist'!G31","v":0}]
[null,null,{"$f":"IF('B151a-Fire safety specialist'!F31=\"\",\"\",\"LIST\")","v":""}]
[null,"FIR - 016",{"$f":"'B151a-Fire safety specialist'!F32","v":0},null,{"$f":"'B151a-Fire safety specialist'!G32","v":0}]
[null,null,{"$f":"IF('B151a-Fire safety specialist'!F32=\"\",\"\",\"LIST\")","v":""}]
[null,"FIR - 017",{"$f":"'B151a-Fire safety specialist'!F33","v":0},null,{"$f":"'B151a-Fire safety specialist'!G33","v":0}]
[null,null,{"$f":"IF('B151a-Fire safety specialist'!F33=\"\",\"\",\"LIST\")","v":""}]
[null,"FIR - 018",{"$f":"'B151a-Fire safety specialist'!F34","v":0},null,{"$f":"'B151a-Fire safety specialist'!G34","v":0}]
[null,null,{"$f":"IF('B151a-Fire safety specialist'!F34=\"\",\"\",\"LIST\")","v":""}]
[null,"FIR - 019",{"$f":"'B151a-Fire safety specialist'!F35","v":0},null,{"$f":"'B151a-Fire safety specialist'!G35","v":0}]
[null,null,{"$f":"IF('B151a-Fire safety specialist'!F35=\"\",\"\",\"LIST\")","v":""}]
[null,"FIR - 020",{"$f":"'B151a-Fire safety specialist'!F36","v":0},null,{"$f":"'B151a-Fire safety specialist'!G36","v":0}]
[null,null,{"$f":"IF('B151a-Fire safety specialist'!F36=\"\",\"\",\"LIST\")","v":""}]
[null,"FIR - 021",{"$f":"'B151a-Fire safety specialist'!F37","v":0},null,{"$f":"'B151a-Fire safety specialist'!G37","v":0}]
[null,null,{"$f":"IF('B151a-Fire safety specialist'!F37=\"\",\"\",\"LIST\")","v":""}]
[null,"FIR - 022",{"$f":"'B151a-Fire safety specialist'!F38","v":0},null,{"$f":"'B151a-Fire safety specialist'!G38","v":0}]
[null,null,{"$f":"IF('B151a-Fire safety specialist'!F38=\"\",\"\",\"LIST\")","v":""}]
[null,"FIR - 023",{"$f":"'B151a-Fire safety specialist'!F39","v":0},null,{"$f":"'B151a-Fire safety specialist'!G39","v":0}]
[null,null,{"$f":"IF('B151a-Fire safety specialist'!F39=\"\",\"\",\"LIST\")","v":""}]
[null,"FIR - 024",{"$f":"'B151a-Fire safety specialist'!F41","v":0},null,{"$f":"'B151a-Fire safety specialist'!G41","v":0}]
[null,null,{"$f":"IF('B151a-Fire safety specialist'!F41=\"\",\"\",\"LIST\")","v":""}]
[null,"FIR - 025",{"$f":"'B151a-Fire safety specialist'!F42","v":"Please provide further justification for the occupant load density for the workshop area and please update the fire report."},null,{"$f":"'B151a-Fire safety specialist'!G42","v":"Resolved"}]
[null,null,{"$f":"IF('B151a-Fire safety specialist'!F42=\"\",\"\",\"LIST\")","v":"LIST"}]
[null,"FIR - 026",{"$f":"'B151a-Fire safety specialist'!F43","v":0},null,{"$f":"'B151a-Fire safety specialist'!G43","v":0}]
[null,null,{"$f":"IF('B151a-Fire safety specialist'!F43=\"\",\"\",\"LIST\")","v":""}]
[null,"FIR - 027",{"$f":"'B151a-Fire safety specialist'!F44","v":0},null,{"$f":"'B151a-Fire safety specialist'!G44","v":0}]
[null,null,{"$f":"IF('B151a-Fire safety specialist'!F44=\"\",\"\",\"LIST\")","v":""}]
[null,"FIR - 028",{"$f":"'B151a-Fire safety specialist'!F45","v":0},null,{"$f":"'B151a-Fire safety specialist'!G45","v":0}]
[null,null,{"$f":"IF('B151a-Fire safety specialist'!F45=\"\",\"\",\"LIST\")","v":""}]
[null,"FIR - 029",{"$f":"'B151a-Fire safety specialist'!F46","v":0},null,{"$f":"'B151a-Fire safety specialist'!G46","v":0}]
[null,null,{"$f":"IF('B151a-Fire safety specialist'!F46=\"\",\"\",\"LIST\")","v":""}]
[null,"FIR - 030",{"$f":"'B151a-Fire safety specialist'!F47","v":0},null,{"$f":"'B151a-Fire safety specialist'!G47","v":0}]
[null,null,{"$f":"IF('B151a-Fire safety specialist'!F47=\"\",\"\",\"LIST\")","v":""}]
[null,"FIR - 031",{"$f":"'B151a-Fire safety specialist'!F48","v":"The fire report requirements include replacing key locks with snib locks. To demonstrate that the design is coordinated please provide a door hardware schedule as part of the architectural set of drawings. \nADDED 13/7/2017 - Fire engineer response noted.  Please provide the door schedule detailing the required new door locks to be provided for compliance."},null,{"$f":"'B151a-Fire safety specialist'!G48","v":"Resolved"}]
[null,null,{"$f":"IF('B151a-Fire safety specialist'!F48=\"\",\"\",\"LIST\")","v":"LIST"}]
[null,"FIR - 032",{"$f":"'B151a-Fire safety specialist'!F49","v":0},null,{"$f":"'B151a-Fire safety specialist'!G49","v":0}]
[null,null,{"$f":"IF('B151a-Fire safety specialist'!F49=\"\",\"\",\"LIST\")","v":""}]
[null,"FIR - 033",{"$f":"'B151a-Fire safety specialist'!F50","v":0},null,{"$f":"'B151a-Fire safety specialist'!G50","v":0}]
[null,null,{"$f":"IF('B151a-Fire safety specialist'!F50=\"\",\"\",\"LIST\")","v":""}]
[null,"FIR - 034",{"$f":"'B151a-Fire safety specialist'!F51","v":0},null,{"$f":"'B151a-Fire safety specialist'!G51","v":0}]
[null,null,{"$f":"IF('B151a-Fire safety specialist'!F51=\"\",\"\",\"LIST\")","v":""}]
[null,"FIR - 035",{"$f":"'B151a-Fire safety specialist'!F52","v":0},null,{"$f":"'B151a-Fire safety specialist'!G52","v":0}]
[null,null,{"$f":"IF('B151a-Fire safety specialist'!F52=\"\",\"\",\"LIST\")","v":""}]
[null,"FIR - 036",{"$f":"'B151a-Fire safety specialist'!F53","v":0},null,{"$f":"'B151a-Fire safety specialist'!G53","v":0}]
[null,null,{"$f":"IF('B151a-Fire safety specialist'!F53=\"\",\"\",\"LIST\")","v":""}]
[null,"FIR - 037",{"$f":"'B151a-Fire safety specialist'!F54","v":"The fire report states that the wall and ceiling linings in the new office extension is painted plasterboard, however it appears that plywood is noted. Please update the fire report / architectural plans as applicable to demonstrate that the design has been coordinated. "},null,{"$f":"'B151a-Fire safety specialist'!G54","v":"Resolved"}]
[null,null,{"$f":"IF('B151a-Fire safety specialist'!F54=\"\",\"\",\"LIST\")","v":"LIST"}]
[null,"FIR - 038",{"$f":"'B151a-Fire safety specialist'!F55","v":0},null,{"$f":"'B151a-Fire safety specialist'!G55","v":0}]
[null,null,{"$f":"IF('B151a-Fire safety specialist'!F55=\"\",\"\",\"LIST\")","v":""}]
[null,"FIR - 039",{"$f":"'B151a-Fire safety specialist'!F56","v":0},null,{"$f":"'B151a-Fire safety specialist'!G56","v":0}]
[null,null,{"$f":"IF('B151a-Fire safety specialist'!F56=\"\",\"\",\"LIST\")","v":""}]
[null,"FIR - 040",{"$f":"'B151a-Fire safety specialist'!F57","v":0},null,{"$f":"'B151a-Fire safety specialist'!G57","v":0}]
[null,null,{"$f":"IF('B151a-Fire safety specialist'!F57=\"\",\"\",\"LIST\")","v":""}]
[null,"FIR - 041",{"$f":"'B151a-Fire safety specialist'!F59","v":0},null,{"$f":"'B151a-Fire safety specialist'!G59","v":0}]
[null,null,{"$f":"IF('B151a-Fire safety specialist'!F59=\"\",\"\",\"LIST\")","v":""}]
[null,"FIR - 042",{"$f":"'B151a-Fire safety specialist'!F60","v":0},null,{"$f":"'B151a-Fire safety specialist'!G60","v":0}]
[null,null,{"$f":"IF('B151a-Fire safety specialist'!F60=\"\",\"\",\"LIST\")","v":""}]
[null,"FIR - 043",{"$f":"'B151a-Fire safety specialist'!F61","v":0},null,{"$f":"'B151a-Fire safety specialist'!G61","v":0}]
[null,null,{"$f":"IF('B151a-Fire safety specialist'!F61=\"\",\"\",\"LIST\")","v":""}]
[null,"FIR - 044",{"$f":"'B151a-Fire safety specialist'!F62","v":"Please provide an emergency lighting design to demonstrate compliance with F6 of NZ Building Code as required in the Fire report. Please refer to paragraph 1.7 of F6/AS1 for the documentation you need to supply. Please provide full technical justification of the design and a PS1 from a CPEng engineer with assessed area being electrical engineering, or from a professional lighting consultant. \nADDED 13/7/2017 - Query outstanding"},null,{"$f":"'B151a-Fire safety specialist'!G62","v":"Resolved"}]
[null,null,{"$f":"IF('B151a-Fire safety specialist'!F62=\"\",\"\",\"LIST\")","v":"LIST"}]
[null,"FIR - 045",{"$f":"'B151a-Fire safety specialist'!F63","v":0},null,{"$f":"'B151a-Fire safety specialist'!G63","v":0}]
[null,null,{"$f":"IF('B151a-Fire safety specialist'!F63=\"\",\"\",\"LIST\")","v":""}]
[null,"FIR - 046",{"$f":"'B151a-Fire safety specialist'!F64","v":"We believe it is more appropriate for your emergency lighting designer to carry out the necessary inspections and provide a PS4 for the emergency lighting design at the completion of the project. Please confirm this is to be arranged.\nADDED 13/7/2017 - Query outstanding"},null,{"$f":"'B151a-Fire safety specialist'!G64","v":"Resolved"}]
[null,null,{"$f":"IF('B151a-Fire safety specialist'!F64=\"\",\"\",\"LIST\")","v":"LIST"}]
[null,"FIR - 047",{"$f":"'B151a-Fire safety specialist'!F65","v":0},null,{"$f":"'B151a-Fire safety specialist'!G65","v":0}]
[null,null,{"$f":"IF('B151a-Fire safety specialist'!F65=\"\",\"\",\"LIST\")","v":""}]
[null,"FIR - 048",{"$f":"'B151a-Fire safety specialist'!F67","v":0},null,{"$f":"'B151a-Fire safety specialist'!G67","v":0}]
[null,null,{"$f":"IF('B151a-Fire safety specialist'!F67=\"\",\"\",\"LIST\")","v":""}]
[null,"FIR - 049",{"$f":"'B151a-Fire safety specialist'!F68","v":0},null,{"$f":"'B151a-Fire safety specialist'!G68","v":0}]
[null,null,{"$f":"IF('B151a-Fire safety specialist'!F68=\"\",\"\",\"LIST\")","v":""}]
[null,"FIR - 050",{"$f":"'B151a-Fire safety specialist'!F69","v":0},null,{"$f":"'B151a-Fire safety specialist'!G69","v":0}]
[null,null,{"$f":"IF('B151a-Fire safety specialist'!F69=\"\",\"\",\"LIST\")","v":""}]
[null,"FIR - 051",{"$f":"'B151a-Fire safety specialist'!F70","v":0},null,{"$f":"'B151a-Fire safety specialist'!G70","v":0}]
[null,null,{"$f":"IF('B151a-Fire safety specialist'!F70=\"\",\"\",\"LIST\")","v":""}]
[null,"FIR - 052",{"$f":"'B151a-Fire safety specialist'!F71","v":0},null,{"$f":"'B151a-Fire safety specialist'!G71","v":0}]
[null,null,{"$f":"IF('B151a-Fire safety specialist'!F71=\"\",\"\",\"LIST\")","v":""}]
[null,null,{"$f":"IF('B151b-Fire safety specialist'!K40>1,'B151b-Fire safety specialist'!O38,\"\")","v":""}]
[null,"DPF - 001",{"$f":"'B151b-Fire safety specialist'!F22","v":0},null,{"$f":"'B151b-Fire safety specialist'!G22","v":0}]
[null,null,{"$f":"IF('B151b-Fire safety specialist'!F22=\"\",\"\",\"LIST\")","v":""}]
[null,"DPF - 002",{"$f":"'B151b-Fire safety specialist'!F23","v":0},null,{"$f":"'B151b-Fire safety specialist'!G23","v":0}]
[null,null,{"$f":"IF('B151b-Fire safety specialist'!F23=\"\",\"\",\"LIST\")","v":""}]
[null,"DPF - 003",{"$f":"'B151b-Fire safety specialist'!F25","v":0},null,{"$f":"'B151b-Fire safety specialist'!G25","v":0}]
[null,null,{"$f":"IF('B151b-Fire safety specialist'!F25=\"\",\"\",\"LIST\")","v":""}]
[null,"DPF - 004",{"$f":"'B151b-Fire safety specialist'!F27","v":0},null,{"$f":"'B151b-Fire safety specialist'!G27","v":0}]
[null,null,{"$f":"IF('B151b-Fire safety specialist'!F27=\"\",\"\",\"LIST\")","v":""}]
[null,"DPF - 005",{"$f":"'B151b-Fire safety specialist'!F28","v":0},null,{"$f":"'B151b-Fire safety specialist'!G28","v":0}]
[null,null,{"$f":"IF('B151b-Fire safety specialist'!F28=\"\",\"\",\"LIST\")","v":""}]
[null,"DPF - 006",{"$f":"'B151b-Fire safety specialist'!F29","v":0},null,{"$f":"'B151b-Fire safety specialist'!G29","v":0}]
[null,null,{"$f":"IF('B151b-Fire safety specialist'!F29=\"\",\"\",\"LIST\")","v":""}]
[null,"DPF - 007",{"$f":"'B151b-Fire safety specialist'!F30","v":0},null,{"$f":"'B151b-Fire safety specialist'!G30","v":0}]
[null,null,{"$f":"IF('B151b-Fire safety specialist'!F30=\"\",\"\",\"LIST\")","v":""}]
[null,"DPF - 008",{"$f":"'B151b-Fire safety specialist'!F31","v":0},null,{"$f":"'B151b-Fire safety specialist'!G31","v":0}]
[null,null,{"$f":"IF('B151b-Fire safety specialist'!F31=\"\",\"\",\"LIST\")","v":""}]
[null,"DPF - 009",{"$f":"'B151b-Fire safety specialist'!F32","v":0},null,{"$f":"'B151b-Fire safety specialist'!G32","v":0}]
[null,null,{"$f":"IF('B151b-Fire safety specialist'!F32=\"\",\"\",\"LIST\")","v":""}]
[null,"DPF - 010",{"$f":"'B151b-Fire safety specialist'!F33","v":0},null,{"$f":"'B151b-Fire safety specialist'!G33","v":0}]
[null,null,{"$f":"IF('B151b-Fire safety specialist'!F33=\"\",\"\",\"LIST\")","v":""}]
[null,"DPF - 011",{"$f":"'B151b-Fire safety specialist'!F34","v":0},null,{"$f":"'B151b-Fire safety specialist'!G34","v":0}]
[null,null,{"$f":"IF('B151b-Fire safety specialist'!F34=\"\",\"\",\"LIST\")","v":""}]
[null,"DPF - 012",{"$f":"'B151b-Fire safety specialist'!F35","v":0},null,{"$f":"'B151b-Fire safety specialist'!G35","v":0}]
[null,null,{"$f":"IF('B151b-Fire safety specialist'!F35=\"\",\"\",\"LIST\")","v":""}]
[null,"DPF - 013",{"$f":"'B151b-Fire safety specialist'!F36","v":0},null,{"$f":"'B151b-Fire safety specialist'!G36","v":0}]
[null,null,{"$f":"IF('B151b-Fire safety specialist'!F36=\"\",\"\",\"LIST\")","v":""}]
[null,"DPF - 014",{"$f":"'B151b-Fire safety specialist'!F37","v":0},null,{"$f":"'B151b-Fire safety specialist'!G37","v":0}]
[null,null,{"$f":"IF('B151b-Fire safety specialist'!F37=\"\",\"\",\"LIST\")","v":""}]
[null,"DPF - 015",{"$f":"'B151b-Fire safety specialist'!F39","v":0},null,{"$f":"'B151b-Fire safety specialist'!G39","v":0}]
[null,null,{"$f":"IF('B151b-Fire safety specialist'!F39=\"\",\"\",\"LIST\")","v":""}]
[null,null,{"$f":"IF('B160-PS specialist'!N23>1,'B160-PS specialist'!T23,\"\")","v":"Specialist Review : Mechanical Ventilation  (Nick Waddington )"}]
[null,"SER - 001",{"$f":"'B160-PS specialist'!F21","v":"The specialist services reviewer of this application requires the following additional information:\n\nPlease provide PS1 (Design) and associated design details, showing Compliance with Clauses G4 and H1.3.6 of the New Zealand Building Code. Also, a schedule of inspections to be undertaken by the engineer with confirmation that 'as built' drawings and a PS4 will be provided on successful commissioning of the ventilation systems.                      Response received 12/7/17 does not address RFI                                            Response received 1/8/17 gives no indication of how internal office and meeting room are ventilated, does not give any extract rates for toilets and PS1 provided gives no indication that PS4 will be provided.\n"},null,{"$f":"'B160-PS specialist'!G21","v":"Resolved"}]
[null,null,{"$f":"IF('B160-PS specialist'!F21=\"\",\"\",\"LIST\")","v":"LIST"}]
[null,"SER - 002",{"$f":"'B160-PS specialist'!F22","v":0},null,{"$f":"'B160-PS specialist'!G22","v":0}]
[null,null,{"$f":"IF('B160-PS specialist'!F22=\"\",\"\",\"LIST\")","v":""}]
[null,"SER - 003",{"$f":"'B160-PS specialist'!F23","v":0},null,{"$f":"'B160-PS specialist'!G23","v":0}]
[null,null,{"$f":"IF('B160-PS specialist'!F23=\"\",\"\",\"LIST\")","v":""}]
[null,null,{"$f":"IF('B160-PS specialist'!N26>1,'B160-PS specialist'!P26,\"\")","v":""}]
[null,"SER - 004",{"$f":"'B160-PS specialist'!F25","v":0},null,{"$f":"'B160-PS specialist'!G25","v":0}]
[null,null,{"$f":"IF('B160-PS specialist'!F25=\"\",\"\",\"LIST\")","v":""}]
[null,"SER - 005",{"$f":"'B160-PS specialist'!F26","v":0},null,{"$f":"'B160-PS specialist'!G26","v":0}]
[null,null,{"$f":"IF('B160-PS specialist'!F26=\"\",\"\",\"LIST\")","v":""}]
[null,null,{"$f":"IF('B160-PS specialist'!N29>1,'B160-PS specialist'!P32,\"\")","v":""}]
[null,"SER - 006",{"$f":"'B160-PS specialist'!F28","v":0},null,{"$f":"'B160-PS specialist'!G28","v":0}]
[null,null,{"$f":"IF('B160-PS specialist'!F28=\"\",\"\",\"LIST\")","v":""}]
[null,"SER - 007",{"$f":"'B160-PS specialist'!F29","v":0},null,{"$f":"'B160-PS specialist'!G29","v":0}]
[null,null,{"$f":"IF('B160-PS specialist'!F29=\"\",\"\",\"LIST\")","v":""}]
[]
[null,"We have not received the requested information and cannot complete processing your application. The timeframe in which to supply the requested information will expire on"]
[null,{"$f":"TODAY()+14","v":"2017-09-03"}]
[null,"\nPlease provide the items requested above within the timeframe indicated. If you do not provide all the information within this timeframe, you will have to re-submit your application in full.\n\nThis letter is sent to the applicant and the owner, where possible. \n"]
[]
[null,"Yours sincerely"]
[null,null,"."]
[null,null,"."]
[null,null,"."]
[null,{"$f":"'Summary sheet'!E51","v":"Tania McGrath"}]
[null,{"$f":"'Summary sheet'!E52","v":"Building Consent Officer"}]

{"sheet":"B532-Refusal letter","index":14,"n_rows":610,"n_cols":14,"rows_kept":610,"cut":false,"hidden":false,"merged":[[8,5,8,6],[603,1,603,4],[604,1,604,2],[12,1,12,3],[13,1,13,3],[16,1,17,4],[600,1,600,4],[601,1,601,4],[602,1,602,4],[9,1,9,2],[1,1,1,2],[3,1,3,2],[4,1,4,2],[5,1,5,2],[6,1,6,2]]}
[]
[null,{"$f":"TODAY( )","v":"2017-08-20"},null,null,null,"Summary sheet","B501-Not accepted letter"]
[null,null,null,null,null,"Vetting sheet","B501a-Not accepted with invoice"]
[null,{"$f":"'Summary sheet'!$E$7","v":"Trevor Jones "},null,null,null,"B120-Processing sheet","Application update letter"]
[null,{"$f":"'Summary sheet'!E9","v":"47 Second Avenue , Tauranga"},null,null,null,"B150-Structural specialist","B521-RFI letter"]
[null,{"$f":"'Summary sheet'!$E$10","v":"Tauranga"},null,null,null,"B151a-Fire safety specialist","B529-Final reminder letter"]
[null,{"$f":"'Summary sheet'!E8","v":"trevor@architecturaldesigngroup.co.nz"},null,null,null,"B151b-Fire safety specialist","B532-Refusal letter"]
[null,"a","a",null,null,"B160-PS specialist","S71-74 natural hazards"]
[null,"a","a",null,null,"B462-Draft CS"]
[null,{"$f":"\"Dear\"&\" \"&'Summary sheet'!E11","v":"Dear Sir / Madam"}]
[null,"a","a"]
[null,{"$f":"'Summary sheet'!I15&\" \"&'Summary sheet'!E15","v":"Building Consent: BCN/2017/2013"}]
[null,{"$f":"'Summary sheet'!$E$16","v":"80 Byron Street Sydenham "},null,null,null,null,null,null,null,null,null,null,null,{"$f":"B13","v":"80 Byron Street Sydenham "}]
[null,{"$f":"'Summary sheet'!$E$17","v":"Addition to Factory - New Offices, Meeting and Store Room"},null,null,null,null,null,null,null,null,null,null,null,{"$f":"B14","v":"Addition to Factory - New Offices, Meeting and Store Room"}]
[null,"a","a"]
[null,"Application for building consent refused"]
[null,"Your building consent application has been refused under Section 50 of the Building Act 2004 for the following reason(s):\n"]
[]
[null,"a","a"]
[null,"RFI Code\n","RFI Items\n",null,"Status\n"]
[null,"GEN - 001",{"$f":"'B120-Processing sheet'!F15","v":0},null,{"$f":"'B120-Processing sheet'!G15","v":0}]
[null,null,{"$f":"IF('B120-Processing sheet'!F15=\"\",\"\",\"LIST\")","v":""}]
[null,"GEN - 001A",{"$f":"'B120-Processing sheet'!F16","v":0},null,{"$f":"'B120-Processing sheet'!G16","v":0}]
[null,null,{"$f":"IF('B120-Processing sheet'!F16=\"\",\"\",\"LIST\")","v":""}]
[null,"GEN - 001B",{"$f":"'B120-Processing sheet'!F17","v":0},null,{"$f":"'B120-Processing sheet'!G17","v":0}]
[null,null,{"$f":"IF('B120-Processing sheet'!F17=\"\",\"\",\"LIST\")","v":""}]
[null,"GEN - 002",{"$f":"'B120-Processing sheet'!F18","v":0},null,{"$f":"'B120-Processing sheet'!G18","v":0}]
[null,null,{"$f":"IF('B120-Processing sheet'!F18=\"\",\"\",\"LIST\")","v":""}]
[null,"GEN - 003",{"$f":"'B120-Processing sheet'!F19","v":0},null,{"$f":"'B120-Processing sheet'!G19","v":0}]
[null,null,{"$f":"IF('B120-Processing sheet'!F19=\"\",\"\",\"LIST\")","v":""}]
[null,"GEN - 004",{"$f":"'B120-Processing sheet'!F20","v":0},null,{"$f":"'B120-Processing sheet'!G20","v":0}]
[null,null,{"$f":"IF('B120-Processing sheet'!F20=\"\",\"\",\"LIST\")","v":""}]
[null,"GEN - 005",{"$f":"'B120-Processing sheet'!F21","v":0},null,{"$f":"'B120-Processing sheet'!G21","v":0}]
[null,null,{"$f":"IF('B120-Processing sheet'!F21=\"\",\"\",\"LIST\")","v":""}]
[null,"GEN - 006",{"$f":"'B120-Processing sheet'!F22","v":"Provide on the site plan, sufficient levels to establish compliance with [B1, E1, E2, G13, City Plan]. These should include new and existing finished floor levels and site levels to Christchurch Drainage Datum, including datum point location."},null,{"$f":"'B120-Processing sheet'!G22","v":"Resolved"}]
[null,null,{"$f":"IF('B120-Processing sheet'!F22=\"\",\"\",\"LIST\")","v":"LIST"}]
[null,"GEN - 007",{"$f":"'B120-Processing sheet'!F23","v":"Please indicate the location of the block wall on the site plan in relation to the boundary to demonstrate that this building will be constructed within the boundaries of the property (including foundations).\n\n13/07/07 - thank you for your response, however the survey plan suggests that the existing building may be constructed over the boundary. Please confirm that the addition will be constructed wholly within the boundaries of this property, note you will be required to supply a building location certificate at setout of the foundation to confirm that the addition is within the property boundary."},null,{"$f":"'B120-Processing sheet'!G23","v":"Resolved"}]
[null,null,{"$f":"IF('B120-Processing sheet'!F23=\"\",\"\",\"LIST\")","v":"LIST"}]
[null,"GEN - 008",{"$f":"'B120-Processing sheet'!F24","v":0},null,{"$f":"'B120-Processing sheet'!G24","v":0}]
[null,null,{"$f":"IF('B120-Processing sheet'!F24=\"\",\"\",\"LIST\")","v":""}]
[null,"GEN - 009",{"$f":"'B120-Processing sheet'!F25","v":0},null,{"$f":"'B120-Processing sheet'!G25","v":0}]
[null,null,{"$f":"IF('B120-Processing sheet'!F25=\"\",\"\",\"LIST\")","v":""}]
[null,"GEN - 010",{"$f":"'B120-Processing sheet'!F26","v":"Please provide a site specific sediment control plan taking into consideration any drainage outlets that may be existing on site hardstanding area."},null,{"$f":"'B120-Processing sheet'!G26","v":"Resolved"}]
[null,null,{"$f":"IF('B120-Processing sheet'!F26=\"\",\"\",\"LIST\")","v":"LIST"}]
[null,"GEN - 011",{"$f":"'B120-Processing sheet'!F27","v":0},null,{"$f":"'B120-Processing sheet'!G27","v":0}]
[null,null,{"$f":"IF('B120-Processing sheet'!F27=\"\",\"\",\"LIST\")","v":""}]
[null,"GEN - 012",{"$f":"'B120-Processing sheet'!F28","v":"Please provide schedule of construction monitoring that will be conducted by the structural engineer and confirm that a PS4 will be provided when construction complete."},null,{"$f":"'B120-Processing sheet'!G28","v":"Resolved"}]
[null,null,{"$f":"IF('B120-Processing sheet'!F28=\"\",\"\",\"LIST\")","v":"LIST"}]
[null,"BA - 013",{"$f":"'B120-Processing sheet'!F30","v":0},null,{"$f":"'B120-Processing sheet'!G30","v":0}]
[null,null,{"$f":"IF('B120-Processing sheet'!F30=\"\",\"\",\"LIST\")","v":""}]
[null,"B1 - 014",{"$f":"'B120-Processing sheet'!F32","v":0},null,{"$f":"'B120-Processing sheet'!G32","v":0}]
[null,null,{"$f":"IF('B120-Processing sheet'!F32=\"\",\"\",\"LIST\")","v":""}]
[null,"B1 - 015",{"$f":"'B120-Processing sheet'!F33","v":0},null,{"$f":"'B120-Processing sheet'!G33","v":0}]
[null,null,{"$f":"IF('B120-Processing sheet'!F33=\"\",\"\",\"LIST\")","v":""}]
[null,"B1 - 016",{"$f":"'B120-Processing sheet'!F34","v":"1. Please provide a copy of the structural engineering calculations to allow for assessment of compliance with the requirements of B1. RESOLVED\n\n2. Please provide details of how it is intended to connect the new walls to the existing external walls of the building sufficient to demonstrate compliance with requirements of B1 taking into consideration that the design features report indicates that the buildings will be seismically separated however the foundations have been tied together. RESOLVED\n\n3. The information available to Council indicates the presence of external metal structures that appear to be potentially providing additional structural support to the existing building. Please confirm if this is occuring and if so how will that structural element continue to be maintained when the new addition is added. RESOLVED\n\n4. Please provide detail demonstrating how the roof brace in connected to structural elements on Grid line 2 and the central SHS post on Gridline 1 sufficient to demonstrate compliance with the requirements of B1. RESOLVED\n\n5. Please provide documentation to demonstrate that the lateral stability of the stack bond block walls has been achieved sufficient to demonstrate compliance with B1. RESOLVED\n\n6. Please provide a bracing plan and calculations sufficient to demonstrate compliance with the requirements of B1. RESOLVED\n\n7. The lintel above the sliding door appears to be specific design. Please provide documentation to support the size of the lintel indicated in detail 17 sheet A16. RESOLVED\n\n8. The drawings indicate that the opening in the existing wall will be significantly extended. Please provide details of the support for this opening and evidence that the bracing of the existing building can be maintained with this new opening.\n\n14/07/17 - Unable to locate information within engineering calculations as indicated - please direct me to where this information is located."},null,{"$f":"'B120-Processing sheet'!G34","v":"Resolved"}]
[null,null,{"$f":"IF('B120-Processing sheet'!F34=\"\",\"\",\"LIST\")","v":"LIST"}]
[null,"B1 - 017",{"$f":"'B120-Processing sheet'!F35","v":0},null,{"$f":"'B120-Processing sheet'!G35","v":0}]
[null,null,{"$f":"IF('B120-Processing sheet'!F35=\"\",\"\",\"LIST\")","v":""}]
[null,"B1 - 018",{"$f":"'B120-Processing sheet'!F36","v":0},null,{"$f":"'B120-Processing sheet'!G36","v":0}]
[null,null,{"$f":"IF('B120-Processing sheet'!F36=\"\",\"\",\"LIST\")","v":""}]
[null,"B1 - 019",{"$f":"'B120-Processing sheet'!F37","v":0},null,{"$f":"'B120-Processing sheet'!G37","v":0}]
[null,null,{"$f":"IF('B120-Processing sheet'!F37=\"\",\"\",\"LIST\")","v":""}]
[null,"B1 - 020",{"$f":"'B120-Processing sheet'!F38","v":"As this project involves connection with the existing building please provide a Detailed Engineering Evaluation (DEE) for the existing building.\n\n13/07/17 - Your response refers to a report by Holmes Consulting, however no report was received"},null,{"$f":"'B120-Processing sheet'!G38","v":"Resolved"}]
[null,null,{"$f":"IF('B120-Processing sheet'!F38=\"\",\"\",\"LIST\")","v":"LIST"}]
[null,"B1 - 021",{"$f":"'B120-Processing sheet'!F39","v":0},null,{"$f":"'B120-Processing sheet'!G39","v":0}]
[null,null,{"$f":"IF('B120-Processing sheet'!F39=\"\",\"\",\"LIST\")","v":""}]
[null,"B1 - 022",{"$f":"'B120-Processing sheet'!F41","v":0},null,{"$f":"'B120-Processing sheet'!G41","v":0}]
[null,null,{"$f":"IF('B120-Processing sheet'!F41=\"\",\"\",\"LIST\")","v":""}]
[null,"B1 - 023",{"$f":"'B120-Processing sheet'!F42","v":0},null,{"$f":"'B120-Processing sheet'!G42","v":0}]
[null,null,{"$f":"IF('B120-Processing sheet'!F42=\"\",\"\",\"LIST\")","v":""}]
[null,"B1 - 024",{"$f":"'B120-Processing sheet'!F43","v":0},null,{"$f":"'B120-Processing sheet'!G43","v":0}]
[null,null,{"$f":"IF('B120-Processing sheet'!F43=\"\",\"\",\"LIST\")","v":""}]
[null,"B1 - 025",{"$f":"'B120-Processing sheet'!F44","v":0},null,{"$f":"'B120-Processing sheet'!G44","v":0}]
[null,null,{"$f":"IF('B120-Processing sheet'!F44=\"\",\"\",\"LIST\")","v":""}]
[null,"B1 - 026",{"$f":"'B120-Processing sheet'!F45","v":0},null,{"$f":"'B120-Processing sheet'!G45","v":0}]
[null,null,{"$f":"IF('B120-Processing sheet'!F45=\"\",\"\",\"LIST\")","v":""}]
[null,"B1 - 027",{"$f":"'B120-Processing sheet'!F46","v":0},null,{"$f":"'B120-Processing sheet'!G46","v":0}]
[null,null,{"$f":"IF('B120-Processing sheet'!F46=\"\",\"\",\"LIST\")","v":""}]
[null,"B1 - 028",{"$f":"'B120-Processing sheet'!F47","v":0},null,{"$f":"'B120-Processing sheet'!G47","v":0}]
[null,null,{"$f":"IF('B120-Processing sheet'!F47=\"\",\"\",\"LIST\")","v":""}]
[null,"B1 - 029",{"$f":"'B120-Processing sheet'!F48","v":0},null,{"$f":"'B120-Processing sheet'!G48","v":0}]
[null,null,{"$f":"IF('B120-Processing sheet'!F48=\"\",\"\",\"LIST\")","v":""}]
[null,"B1 - 030",{"$f":"'B120-Processing sheet'!F49","v":0},null,{"$f":"'B120-Processing sheet'!G49","v":0}]
[null,null,{"$f":"IF('B120-Processing sheet'!F49=\"\",\"\",\"LIST\")","v":""}]
[null,"B1 - 031",{"$f":"'B120-Processing sheet'!F50","v":0},null,{"$f":"'B120-Processing sheet'!G50","v":0}]
[null,null,{"$f":"IF('B120-Processing sheet'!F50=\"\",\"\",\"LIST\")","v":""}]
[null,"B1 - 032",{"$f":"'B120-Processing sheet'!F51","v":0},null,{"$f":"'B120-Processing sheet'!G51","v":0}]
[null,null,{"$f":"IF('B120-Processing sheet'!F51=\"\",\"\",\"LIST\")","v":""}]
[null,"B1 - 033",{"$f":"'B120-Processing sheet'!F52","v":0},null,{"$f":"'B120-Processing sheet'!G52","v":0}]
[null,null,{"$f":"IF('B120-Processing sheet'!F52=\"\",\"\",\"LIST\")","v":""}]
[null,"B1 - 034",{"$f":"'B120-Processing sheet'!F53","v":0},null,{"$f":"'B120-Processing sheet'!G53","v":0}]
[null,null,{"$f":"IF('B120-Processing sheet'!F53=\"\",\"\",\"LIST\")","v":""}]
[null,"B1 - 035",{"$f":"'B120-Processing sheet'!F54","v":0},null,{"$f":"'B120-Processing sheet'!G54","v":0}]
[null,null,{"$f":"IF('B120-Processing sheet'!F54=\"\",\"\",\"LIST\")","v":""}]
[null,"B1 - 036",{"$f":"'B120-Processing sheet'!F55","v":0},null,{"$f":"'B120-Processing sheet'!G55","v":0}]
[null,null,{"$f":"IF('B120-Processing sheet'!F55=\"\",\"\",\"LIST\")","v":""}]
[null,"B1 - 037",{"$f":"'B120-Processing sheet'!F56","v":0},null,{"$f":"'B120-Processing sheet'!G56","v":0}]
[null,null,{"$f":"IF('B120-Processing sheet'!F56=\"\",\"\",\"LIST\")","v":""}]
[null,"B1 - 038",{"$f":"'B120-Processing sheet'!F57","v":0},null,{"$f":"'B120-Processing sheet'!G57","v":0}]
[null,null,{"$f":"IF('B120-Processing sheet'!F57=\"\",\"\",\"LIST\")","v":""}]
[null,"B1 - 039",{"$f":"'B120-Processing sheet'!F58","v":0},null,{"$f":"'B120-Processing sheet'!G58","v":0}]
[null,null,{"$f":"IF('B120-Processing sheet'!F58=\"\",\"\",\"LIST\")","v":""}]
[null,"B1 - 040",{"$f":"'B120-Processing sheet'!F59","v":0},null,{"$f":"'B120-Processing sheet'!G59","v":0}]
[null,null,{"$f":"IF('B120-Processing sheet'!F59=\"\",\"\",\"LIST\")","v":""}]
[null,"B1 - 041",{"$f":"'B120-Processing sheet'!F60","v":0},null,{"$f":"'B120-Processing sheet'!G60","v":0}]
[null,null,{"$f":"IF('B120-Processing sheet'!F60=\"\",\"\",\"LIST\")","v":""}]
[null,"B1 - 042",{"$f":"'B120-Processing sheet'!F61","v":0},null,{"$f":"'B120-Processing sheet'!G61","v":0}]
[null,null,{"$f":"IF('B120-Processing sheet'!F61=\"\",\"\",\"LIST\")","v":""}]
[null,"B1 - 043",{"$f":"'B120-Processing sheet'!F62","v":0},null,{"$f":"'B120-Processing sheet'!G62","v":0}]
[null,null,{"$f":"IF('B120-Processing sheet'!F62=\"\",\"\",\"LIST\")","v":""}]
[null,"B1 - 044",{"$f":"'B120-Processing sheet'!F63","v":0},null,{"$f":"'B120-Processing sheet'!G63","v":0}]
[null,null,{"$f":"IF('B120-Processing sheet'!F63=\"\",\"\",\"LIST\")","v":""}]
[null,"B1 - 045",{"$f":"'B120-Processing sheet'!F64","v":0},null,{"$f":"'B120-Processing sheet'!G64","v":0}]
[null,null,{"$f":"IF('B120-Processing sheet'!F64=\"\",\"\",\"LIST\")","v":""}]
[null,"B1 - 046",{"$f":"'B120-Processing sheet'!F65","v":0},null,{"$f":"'B120-Processing sheet'!G65","v":0}]
[null,null,{"$f":"IF('B120-Processing sheet'!F65=\"\",\"\",\"LIST\")","v":""}]
[null,"B1 - 047",{"$f":"'B120-Processing sheet'!F66","v":0},null,{"$f":"'B120-Processing sheet'!G66","v":0}]
[null,null,{"$f":"IF('B120-Processing sheet'!F66=\"\",\"\",\"LIST\")","v":""}]
[null,"B1 - 048",{"$f":"'B120-Processing sheet'!F67","v":0},null,{"$f":"'B120-Processing sheet'!G67","v":0}]
[null,null,{"$f":"IF('B120-Processing sheet'!F67=\"\",\"\",\"LIST\")","v":""}]
[null,"B1 - 049",{"$f":"'B120-Processing sheet'!F68","v":"Please review the internal wall framing spacings taking into consideration the wall height of 2.7m. 90x45 @ 600mm centres does not meet the requirements of Table 8.2 NZS3604:2011."},null,{"$f":"'B120-Processing sheet'!G68","v":"Resolved"}]
[null,null,{"$f":"IF('B120-Processing sheet'!F68=\"\",\"\",\"LIST\")","v":"LIST"}]
[null,"B1 - 050",{"$f":"'B120-Processing sheet'!F69","v":0},null,{"$f":"'B120-Processing sheet'!G69","v":0}]
[null,null,{"$f":"IF('B120-Processing sheet'!F69=\"\",\"\",\"LIST\")","v":""}]
[null,"B1 - 051",{"$f":"'B120-Processing sheet'!F70","v":0},null,{"$f":"'B120-Processing sheet'!G70","v":0}]
[null,null,{"$f":"IF('B120-Processing sheet'!F70=\"\",\"\",\"LIST\")","v":""}]
[null,"B1 - 052",{"$f":"'B120-Processing sheet'!F71","v":0},null,{"$f":"'B120-Processing sheet'!G71","v":0}]
[null,null,{"$f":"IF('B120-Processing sheet'!F71=\"\",\"\",\"LIST\")","v":""}]
[null,"B1 - 053",{"$f":"'B120-Processing sheet'!F72","v":0},null,{"$f":"'B120-Processing sheet'!G72","v":0}]
[null,null,{"$f":"IF('B120-Processing sheet'!F72=\"\",\"\",\"LIST\")","v":""}]
[null,"B1 - 054",{"$f":"'B120-Processing sheet'!F73","v":0},null,{"$f":"'B120-Processing sheet'!G73","v":0}]
[null,null,{"$f":"IF('B120-Processing sheet'!F73=\"\",\"\",\"LIST\")","v":""}]
[null,"B1 - 055",{"$f":"'B120-Processing sheet'!F74","v":"Detail 11 sheet A15 indicates the presence of outriggers please provide sufficient details to demonstrate compliance with B1. A roof framing plan may be appropriate which includes length of outrigger over hang and the support for the metal roofing at the eave."},null,{"$f":"'B120-Processing sheet'!G74","v":"Resolved"}]
[null,null,{"$f":"IF('B120-Processing sheet'!F74=\"\",\"\",\"LIST\")","v":"LIST"}]
[null,"B1 - 056",{"$f":"'B120-Processing sheet'!F75","v":0},null,{"$f":"'B120-Processing sheet'!G75","v":0}]
[null,null,{"$f":"IF('B120-Processing sheet'!F75=\"\",\"\",\"LIST\")","v":""}]
[null,"B1 - 057",{"$f":"'B120-Processing sheet'!F76","v":0},null,{"$f":"'B120-Processing sheet'!G76","v":0}]
[null,null,{"$f":"IF('B120-Processing sheet'!F76=\"\",\"\",\"LIST\")","v":""}]
[null,"B1 - 058",{"$f":"'B120-Processing sheet'!F77","v":0},null,{"$f":"'B120-Processing sheet'!G77","v":0}]
[null,null,{"$f":"IF('B120-Processing sheet'!F77=\"\",\"\",\"LIST\")","v":""}]
[null,"B1 - 059",{"$f":"'B120-Processing sheet'!F78","v":0},null,{"$f":"'B120-Processing sheet'!G78","v":0}]
[null,null,{"$f":"IF('B120-Processing sheet'!F78=\"\",\"\",\"LIST\")","v":""}]
[null,"B1 - 060",{"$f":"'B120-Processing sheet'!F79","v":0},null,{"$f":"'B120-Processing sheet'!G79","v":0}]
[null,null,{"$f":"IF('B120-Processing sheet'!F79=\"\",\"\",\"LIST\")","v":""}]
[null,"B1 - 061",{"$f":"'B120-Processing sheet'!F80","v":0},null,{"$f":"'B120-Processing sheet'!G80","v":0}]
[null,null,{"$f":"IF('B120-Processing sheet'!F80=\"\",\"\",\"LIST\")","v":""}]
[null,"B1 - 062",{"$f":"'B120-Processing sheet'!F81","v":0},null,{"$f":"'B120-Processing sheet'!G81","v":0}]
[null,null,{"$f":"IF('B120-Processing sheet'!F81=\"\",\"\",\"LIST\")","v":""}]
[null,"B2 - 063",{"$f":"'B120-Processing sheet'!F83","v":0},null,{"$f":"'B120-Processing sheet'!G83","v":0}]
[null,null,{"$f":"IF('B120-Processing sheet'!F83=\"\",\"\",\"LIST\")","v":""}]
[null,"B2 - 064",{"$f":"'B120-Processing sheet'!F84","v":"Please provide finished floor level for the addition. Whilst it is noted that the building does not need to meet the requirements of E1, it will be required to achieve compliance with 50 year durability requirements. As the internal of the building consistents of structural elements which are susceptible to the impact of moisture please provide details of how it is intended to ensure the structural integrity of these elements.\n\n13/07/17 - thank you for the revised detail for the internal walls, however it has been noted there is a timber external wall which provides some structural support and will also require protection. Please review/revise as appropriate."},null,{"$f":"'B120-Processing sheet'!G84","v":"Resolved"}]
[null,null,{"$f":"IF('B120-Processing sheet'!F84=\"\",\"\",\"LIST\")","v":"LIST"}]
[null,"B2 - 065",{"$f":"'B120-Processing sheet'!F85","v":0},null,{"$f":"'B120-Processing sheet'!G85","v":0}]
[null,null,{"$f":"IF('B120-Processing sheet'!F85=\"\",\"\",\"LIST\")","v":""}]
[null,"B2 - 066",{"$f":"'B120-Processing sheet'!F86","v":0},null,{"$f":"'B120-Processing sheet'!G86","v":0}]
[null,null,{"$f":"IF('B120-Processing sheet'!F86=\"\",\"\",\"LIST\")","v":""}]
[null,"B2 - 067",{"$f":"'B120-Processing sheet'!F87","v":0},null,{"$f":"'B120-Processing sheet'!G87","v":0}]
[null,null,{"$f":"IF('B120-Processing sheet'!F87=\"\",\"\",\"LIST\")","v":""}]
[null,"B2 - 068",{"$f":"'B120-Processing sheet'!F88","v":0},null,{"$f":"'B120-Processing sheet'!G88","v":0}]
[null,null,{"$f":"IF('B120-Processing sheet'!F88=\"\",\"\",\"LIST\")","v":""}]
[null,"C1 - 069",{"$f":"'B120-Processing sheet'!F90","v":0},null,{"$f":"'B120-Processing sheet'!G90","v":0}]
[null,null,{"$f":"IF('B120-Processing sheet'!F90=\"\",\"\",\"LIST\")","v":""}]
[null,"D1 – 070",{"$f":"'B120-Processing sheet'!F92","v":0},null,{"$f":"'B120-Processing sheet'!G92","v":0}]
[null,null,{"$f":"IF('B120-Processing sheet'!F92=\"\",\"\",\"LIST\")","v":""}]
[null,"D1 – 071",{"$f":"'B120-Processing sheet'!F93","v":0},null,{"$f":"'B120-Processing sheet'!G93","v":0}]
[null,null,{"$f":"IF('B120-Processing sheet'!F93=\"\",\"\",\"LIST\")","v":""}]
[null,"D1 – 072",{"$f":"'B120-Processing sheet'!F94","v":0},null,{"$f":"'B120-Processing sheet'!G94","v":0}]
[null,null,{"$f":"IF('B120-Processing sheet'!F94=\"\",\"\",\"LIST\")","v":""}]
[null,"D1 – 073",{"$f":"'B120-Processing sheet'!F95","v":0},null,{"$f":"'B120-Processing sheet'!G95","v":0}]
[null,null,{"$f":"IF('B120-Processing sheet'!F95=\"\",\"\",\"LIST\")","v":""}]
[null,"D1 – 074",{"$f":"'B120-Processing sheet'!F96","v":"1. Please provide finished floor level between the existing and new floors sufficient to demonstrate compliance with the requirement of D1 in relation to isolated steps. RESOLVED\n\n2. Please review detail 18 sheet A16. The installation of the channel drain 100mm below the finished floor level and also door sill indicates the presence of an isolated step at this entrance which does not comply with the requirements of D1.\n\n13/07/17 - Thank you for the revised detail, however the dimensions provide are not within the scope of D1/AS1 4.1.1 and figure 11 ie risers of less than 150mm (less than 23 degree pitch) are not acceptable - Please review as appropriate. For this to be reviewed as an alterntive solution sufficient information to demonstrate compliance with D1 will be required.\n\n02/08/17 - Thank you for the details, however as you have indicated two risers please provide the details of the handrail sufficient to demonstrate compliance with the requirements of D1.3.2(K)."},null,{"$f":"'B120-Processing sheet'!G96","v":"Resolved"}]
[null,null,{"$f":"IF('B120-Processing sheet'!F96=\"\",\"\",\"LIST\")","v":"LIST"}]
[null,"D1 – 075",{"$f":"'B120-Processing sheet'!F97","v":0},null,{"$f":"'B120-Processing sheet'!G97","v":0}]
[null,null,{"$f":"IF('B120-Processing sheet'!F97=\"\",\"\",\"LIST\")","v":""}]
[null,"D1 – 076",{"$f":"'B120-Processing sheet'!F98","v":0},null,{"$f":"'B120-Processing sheet'!G98","v":0}]
[null,null,{"$f":"IF('B120-Processing sheet'!F98=\"\",\"\",\"LIST\")","v":""}]
[null,"D1 – 077",{"$f":"'B120-Processing sheet'!F99","v":0},null,{"$f":"'B120-Processing sheet'!G99","v":0}]
[null,null,{"$f":"IF('B120-Processing sheet'!F99=\"\",\"\",\"LIST\")","v":""}]
[null,"D1 – 078",{"$f":"'B120-Processing sheet'!F100","v":"Please provide a sill detail for door indicated on the East side of the addition sufficient to demonstrate compliance with the requirements of D1 and E2 in relation to accessible route."},null,{"$f":"'B120-Processing sheet'!G100","v":"Resolved"}]
[null,null,{"$f":"IF('B120-Processing sheet'!F100=\"\",\"\",\"LIST\")","v":"LIST"}]
[null,"D1 – 079",{"$f":"'B120-Processing sheet'!F101","v":0},null,{"$f":"'B120-Processing sheet'!G101","v":0}]
[null,null,{"$f":"IF('B120-Processing sheet'!F101=\"\",\"\",\"LIST\")","v":""}]
[null,"D1 – 080",{"$f":"'B120-Processing sheet'!F102","v":0},null,{"$f":"'B120-Processing sheet'!G102","v":0}]
[null,null,{"$f":"IF('B120-Processing sheet'!F102=\"\",\"\",\"LIST\")","v":""}]
[null,"D1 – 081",{"$f":"'B120-Processing sheet'!F103","v":0},null,{"$f":"'B120-Processing sheet'!G103","v":0}]
[null,null,{"$f":"IF('B120-Processing sheet'!F103=\"\",\"\",\"LIST\")","v":""}]
[null,"D1 – 082",{"$f":"'B120-Processing sheet'!F104","v":0},null,{"$f":"'B120-Processing sheet'!G104","v":0}]
[null,null,{"$f":"IF('B120-Processing sheet'!F104=\"\",\"\",\"LIST\")","v":""}]
[null,"D1 – 083",{"$f":"'B120-Processing sheet'!F105","v":0},null,{"$f":"'B120-Processing sheet'!G105","v":0}]
[null,null,{"$f":"IF('B120-Processing sheet'!F105=\"\",\"\",\"LIST\")","v":""}]
[null,"D1 – 084",{"$f":"'B120-Processing sheet'!F106","v":0},null,{"$f":"'B120-Processing sheet'!G106","v":0}]
[null,null,{"$f":"IF('B120-Processing sheet'!F106=\"\",\"\",\"LIST\")","v":""}]
[null,"D1 – 085",{"$f":"'B120-Processing sheet'!F107","v":0},null,{"$f":"'B120-Processing sheet'!G107","v":0}]
[null,null,{"$f":"IF('B120-Processing sheet'!F107=\"\",\"\",\"LIST\")","v":""}]
[null,"D2 – 086",{"$f":"'B120-Processing sheet'!F109","v":0},null,{"$f":"'B120-Processing sheet'!G109","v":0}]
[null,null,{"$f":"IF('B120-Processing sheet'!F109=\"\",\"\",\"LIST\")","v":""}]
[null,"D2 – 087",{"$f":"'B120-Processing sheet'!F110","v":0},null,{"$f":"'B120-Processing sheet'!G110","v":0}]
[null,null,{"$f":"IF('B120-Processing sheet'!F110=\"\",\"\",\"LIST\")","v":""}]
[null,"E1 – 088",{"$f":"'B120-Processing sheet'!F112","v":0},null,{"$f":"'B120-Processing sheet'!G112","v":0}]
[null,null,{"$f":"IF('B120-Processing sheet'!F112=\"\",\"\",\"LIST\")","v":""}]
[null,"E1 – 089",{"$f":"'B120-Processing sheet'!F113","v":"Please provide FFL and the ground to  floor separation. 13/07/2017 Resolved See TRIM 17/741973"},null,{"$f":"'B120-Processing sheet'!G113","v":"Resolved"}]
[null,null,{"$f":"IF('B120-Processing sheet'!F113=\"\",\"\",\"LIST\")","v":"LIST"}]
[null,"E1 – 090",{"$f":"'B120-Processing sheet'!F114","v":"• Authorisation For The Discharge Of Stormwater Into CCC Network: To comply with the New Zealand Building Code stormwater discharge from this property must avoid the likelihood of damage to the outfall in a manner acceptable to the Council’s Assets And Network Unit. In addition, the Council requires stormwater discharge compliance with Environment Canterbury’s regional rules and holds a number of discharge consents throughout its territory which it may use to authorise the discharge of stormwater into its network. Compliance with relevant consent conditions may require onsite stormwater mitigation (treatment and/or attenuation/disposal). Before a Building Consent can be issued you must seek authorisation from Council’s Assets And Network Unit by contacting Stormwater.Approvals@ccc.govt.nz. If Council does not authorise the stormwater discharge under one of its global consents, separate authorisation from Environment Canterbury may be required prior to a Building Consent being issued. The obtained authorisation must be included with the supporting documents of your building consent application.  13/07/2017 Resolved See TRIM 17/363256"},null,{"$f":"'B120-Processing sheet'!G114","v":"Resolved"}]
[null,null,{"$f":"IF('B120-Processing sheet'!F114=\"\",\"\",\"LIST\")","v":"LIST"}]
[null,"E1 – 091",{"$f":"'B120-Processing sheet'!F115","v":"Please provide the grade and pipe size  of the existing stormwater pipe to be disconnected so that the adequacy of the proposed design draining the additional proposed building can be ascertained. In addition please provide the pipe grade of the proposed stormwater pipe on drawing A4. 13/07/2017 Resolved See TRIM 17/741973"},null,{"$f":"'B120-Processing sheet'!G115","v":"Resolved"}]
[null,null,{"$f":"IF('B120-Processing sheet'!F115=\"\",\"\",\"LIST\")","v":"LIST"}]
[null,"E1 – 092",{"$f":"'B120-Processing sheet'!F116","v":0},null,{"$f":"'B120-Processing sheet'!G116","v":0}]
[null,null,{"$f":"IF('B120-Processing sheet'!F116=\"\",\"\",\"LIST\")","v":""}]
[null,"E1 – 093",{"$f":"'B120-Processing sheet'!F117","v":0},null,{"$f":"'B120-Processing sheet'!G117","v":0}]
[null,null,{"$f":"IF('B120-Processing sheet'!F117=\"\",\"\",\"LIST\")","v":""}]
[null,"E1 – 094",{"$f":"'B120-Processing sheet'!F118","v":0},null,{"$f":"'B120-Processing sheet'!G118","v":0}]
[null,null,{"$f":"IF('B120-Processing sheet'!F118=\"\",\"\",\"LIST\")","v":""}]
[null,"E1 – 095",{"$f":"'B120-Processing sheet'!F119","v":"Please provide the size of the proposed overflows on drawing A19  13/07/2017 Resolved See TRIM 17/741973"},null,{"$f":"'B120-Processing sheet'!G119","v":"Resolved"}]
[null,null,{"$f":"IF('B120-Processing sheet'!F119=\"\",\"\",\"LIST\")","v":"LIST"}]
[null,"E2 – 096",{"$f":"'B120-Processing sheet'!F121","v":0},null,{"$f":"'B120-Processing sheet'!G121","v":0}]
[null,null,{"$f":"IF('B120-Processing sheet'!F121=\"\",\"\",\"LIST\")","v":""}]
[null,"E2 – 097",{"$f":"'B120-Processing sheet'!F122","v":0},null,{"$f":"'B120-Processing sheet'!G122","v":0}]
[null,null,{"$f":"IF('B120-Processing sheet'!F122=\"\",\"\",\"LIST\")","v":""}]
[null,"E2 – 098",{"$f":"'B120-Processing sheet'!F123","v":"Please note on elevations the surface finish for the blockwalls sufficient to demonstrate compliance with the requirements of E2."},null,{"$f":"'B120-Processing sheet'!G123","v":"Resolved"}]
[null,null,{"$f":"IF('B120-Processing sheet'!F123=\"\",\"\",\"LIST\")","v":"LIST"}]
[null,"E2 – 099",{"$f":"'B120-Processing sheet'!F124","v":0},null,{"$f":"'B120-Processing sheet'!G124","v":0}]
[null,null,{"$f":"IF('B120-Processing sheet'!F124=\"\",\"\",\"LIST\")","v":""}]
[null,"E2 – 100",{"$f":"'B120-Processing sheet'!F125","v":"1. Please provide cladding details for all junctions sufficient to demonstrate compliance with requirements of E2. This should include but is not limited to the vertical metal cladding to blockwall both vertical junction and internal corner and internal corner for existing metal cladding to new block wall. RESOLVED\n\n2. If it is intended to have the new element structurally seismically separate from the existing building (as identified in the structural engineers design features report), please provide details for the junctions between the new and existing walls sufficient to demonstrate compliance with the requirements of E2.\n\n13/07/17 - Thank you for the additional details. Please review detail 23 Sheet A22. It appears the existing metal wall cladding is shown as continuous within the seismic gap required. Also Detail 24 same sheet indicates the presence of blocking within this seismic gap. Please remove from details to ensure full depth of seismic separation is maintained. RESOLVED\n\n13/07/17 - NEW - please provide a detail for the junction between existing block wall and new blockwall located on the boundary - this detail should reflect the requirement for seismic separation that has been indicated throughout consent documents. Note detail 7 will need to be revised to reflect this requirement and to remove the metal cladding indicated within the seismic gap.\n\n02/08/17 - Thank you for the details provided, however please review detail 28 sheet A22. The gap between the new and existing blockwall is shown to be only 10mm, whereas there is a requirement for 50mm seismic separation. As these are both structural elements the 50mm separation is required to be maintained in this location. Note that as the gap will now exceed 0.1m² (3.5x0.050m) this gap will need to be firerated to the same rating as the wall which is shown to be 120 minute FRR."},null,{"$f":"'B120-Processing sheet'!G125","v":"Resolved"}]
[null,null,{"$f":"IF('B120-Processing sheet'!F125=\"\",\"\",\"LIST\")","v":"LIST"}]
[null,"E2 – 101",{"$f":"'B120-Processing sheet'!F126","v":0},null,{"$f":"'B120-Processing sheet'!G126","v":0}]
[null,null,{"$f":"IF('B120-Processing sheet'!F126=\"\",\"\",\"LIST\")","v":""}]
[null,"E2 – 102",{"$f":"'B120-Processing sheet'!F128","v":0},null,{"$f":"'B120-Processing sheet'!G128","v":0}]
[null,null,{"$f":"IF('B120-Processing sheet'!F128=\"\",\"\",\"LIST\")","v":""}]
[null,"E2 – 103",{"$f":"'B120-Processing sheet'!F129","v":"1. Please provide apron flashing detail for where existing vertical metal wall cladding junctions with new metal roof cladding sufficient to demonstrate compliance with the requirements of E2 and taking into consideration the seismic separation of the new and existing building if appropriate.\n\n2. Please provide rainwater head penetration detail sufficient to demonstrate compliance with the requirements of E2.\n\n3. The North elevation indicates the potential for a clash between the existing external steel (braced) poles and the eave to the east elevation. Please provide sufficient detail to demonstrate compliance with the requirements of E2 at this location."},null,{"$f":"'B120-Processing sheet'!G129","v":"Resolved"}]
[null,null,{"$f":"IF('B120-Processing sheet'!F129=\"\",\"\",\"LIST\")","v":"LIST"}]
[null,"E2 – 104",{"$f":"'B120-Processing sheet'!F130","v":"1. Please provide wall to soffit junction for the raking soffit (greater than 90 degree eave) sufficient to demonstrate compliance with the requirements of E2.\n\n2. Please provide barge detail for junction with both blockwall and vertical metal wall cladding sufficient to demonstrate compliance with the requirements of E2."},null,{"$f":"'B120-Processing sheet'!G130","v":"Resolved"}]
[null,null,{"$f":"IF('B120-Processing sheet'!F130=\"\",\"\",\"LIST\")","v":"LIST"}]
[null,"E2 – 105",{"$f":"'B120-Processing sheet'!F131","v":0},null,{"$f":"'B120-Processing sheet'!G131","v":0}]
[null,null,{"$f":"IF('B120-Processing sheet'!F131=\"\",\"\",\"LIST\")","v":""}]
[null,"E2 – 106",{"$f":"'B120-Processing sheet'!F132","v":0},null,{"$f":"'B120-Processing sheet'!G132","v":0}]
[null,null,{"$f":"IF('B120-Processing sheet'!F132=\"\",\"\",\"LIST\")","v":""}]
[null,"E2 – 107",{"$f":"'B120-Processing sheet'!F133","v":0},null,{"$f":"'B120-Processing sheet'!G133","v":0}]
[null,null,{"$f":"IF('B120-Processing sheet'!F133=\"\",\"\",\"LIST\")","v":""}]
[null,"E2 – 108",{"$f":"'B120-Processing sheet'!F134","v":"Please provide internal gutter detail which indicates extent and all material layers sufficient to demonstrate compliance with the requirements of E2."},null,{"$f":"'B120-Processing sheet'!G134","v":"Resolved"}]
[null,null,{"$f":"IF('B120-Processing sheet'!F134=\"\",\"\",\"LIST\")","v":"LIST"}]
[null,"E2 – 109",{"$f":"'B120-Processing sheet'!F135","v":"1. Please review skylight penetration detail A sheet A20. It appears to reflect skylight located near roof edge (barge) which is not applicable for this application. The drawings appear to suggest the use of a diverter/cricket flashing which there has been no details provided.\n\n2. Please provide pipe roof penetration detail for the terminal vent pentration indicated on sheet A19 sufficient to demonstrate compliance with the requirements of E2."},null,{"$f":"'B120-Processing sheet'!G135","v":"Resolved"}]
[null,null,{"$f":"IF('B120-Processing sheet'!F135=\"\",\"\",\"LIST\")","v":"LIST"}]
[null,"E2 – 110",{"$f":"'B120-Processing sheet'!F136","v":0},null,{"$f":"'B120-Processing sheet'!G136","v":0}]
[null,null,{"$f":"IF('B120-Processing sheet'!F136=\"\",\"\",\"LIST\")","v":""}]
[null,"E2 – 111",{"$f":"'B120-Processing sheet'!F137","v":0},null,{"$f":"'B120-Processing sheet'!G137","v":0}]
[null,null,{"$f":"IF('B120-Processing sheet'!F137=\"\",\"\",\"LIST\")","v":""}]
[null,"E2 – 112",{"$f":"'B120-Processing sheet'!F138","v":0},null,{"$f":"'B120-Processing sheet'!G138","v":0}]
[null,null,{"$f":"IF('B120-Processing sheet'!F138=\"\",\"\",\"LIST\")","v":""}]
[null,"E2 – 113",{"$f":"'B120-Processing sheet'!F139","v":0},null,{"$f":"'B120-Processing sheet'!G139","v":0}]
[null,null,{"$f":"IF('B120-Processing sheet'!F139=\"\",\"\",\"LIST\")","v":""}]
[null,"E2 – 114",{"$f":"'B120-Processing sheet'!F140","v":"1. Please confirm that the membrane extends beyond the blockwall window sill sufficient to demonstrate compliance with the requirements of E2.\n\n2. Please review the head flashing detail for the block wall penetrations sufficient to demonstrate compliance with the requirements of E2. ie no drip edge provided."},null,{"$f":"'B120-Processing sheet'!G140","v":"Resolved"}]
[null,null,{"$f":"IF('B120-Processing sheet'!F140=\"\",\"\",\"LIST\")","v":"LIST"}]
[null,"E2 – 115",{"$f":"'B120-Processing sheet'!F141","v":0},null,{"$f":"'B120-Processing sheet'!G141","v":0}]
[null,null,{"$f":"IF('B120-Processing sheet'!F141=\"\",\"\",\"LIST\")","v":""}]
[null,"E3 – 116",{"$f":"'B120-Processing sheet'!F143","v":0},null,{"$f":"'B120-Processing sheet'!G143","v":0}]
[null,null,{"$f":"IF('B120-Processing sheet'!F143=\"\",\"\",\"LIST\")","v":""}]
[null,"E3 – 117",{"$f":"'B120-Processing sheet'!F144","v":0},null,{"$f":"'B120-Processing sheet'!G144","v":0}]
[null,null,{"$f":"IF('B120-Processing sheet'!F144=\"\",\"\",\"LIST\")","v":""}]
[null,"E3 – 118",{"$f":"'B120-Processing sheet'!F145","v":0},null,{"$f":"'B120-Processing sheet'!G145","v":0}]
[null,null,{"$f":"IF('B120-Processing sheet'!F145=\"\",\"\",\"LIST\")","v":""}]
[null,"E3 – 119",{"$f":"'B120-Processing sheet'!F146","v":0},null,{"$f":"'B120-Processing sheet'!G146","v":0}]
[null,null,{"$f":"IF('B120-Processing sheet'!F146=\"\",\"\",\"LIST\")","v":""}]
[null,"F1 – 120",{"$f":"'B120-Processing sheet'!F148","v":0},null,{"$f":"'B120-Processing sheet'!$G$148","v":0}]
[null,null,{"$f":"IF('B120-Processing sheet'!F148=\"\",\"\",\"LIST\")","v":""}]
[null,"F2 – 121",{"$f":"'B120-Processing sheet'!F150","v":0},null,{"$f":"'B120-Processing sheet'!G150","v":0}]
[null,null,{"$f":"IF('B120-Processing sheet'!F150=\"\",\"\",\"LIST\")","v":""}]
[null,"F2 – 122",{"$f":"'B120-Processing sheet'!F151","v":"Please confirm the presence of manifestation to glazing panels capable of being mistaken for an unimpeded path sufficient to demonstrate compliance with the requirements of F2 ie side panels for sliding doors."},null,{"$f":"'B120-Processing sheet'!G151","v":"Resolved"}]
[null,null,{"$f":"IF('B120-Processing sheet'!F151=\"\",\"\",\"LIST\")","v":"LIST"}]
[null,"F2 – 123",{"$f":"'B120-Processing sheet'!F152","v":0},null,{"$f":"'B120-Processing sheet'!G152","v":0}]
[null,null,{"$f":"IF('B120-Processing sheet'!F152=\"\",\"\",\"LIST\")","v":""}]
[null,"F3 – 124",{"$f":"'B120-Processing sheet'!F154","v":"Please advise if it is intended to store or use any hazardous substances within this new building element, if so please provide sufficient documentation to demonstrate compliance with the requirements of F3."},null,{"$f":"'B120-Processing sheet'!G154","v":"Resolved"}]
[null,null,{"$f":"IF('B120-Processing sheet'!F154=\"\",\"\",\"LIST\")","v":"LIST"}]
[null,"F3 – 125",{"$f":"'B120-Processing sheet'!F155","v":0},null,{"$f":"'B120-Processing sheet'!G155","v":0}]
[null,null,{"$f":"IF('B120-Processing sheet'!F155=\"\",\"\",\"LIST\")","v":""}]
[null,"F4 – 126",{"$f":"'B120-Processing sheet'!F157","v":0},null,{"$f":"'B120-Processing sheet'!G157","v":0}]
[null,null,{"$f":"IF('B120-Processing sheet'!F157=\"\",\"\",\"LIST\")","v":""}]
[null,"F4 – 127",{"$f":"'B120-Processing sheet'!F158","v":0},null,{"$f":"'B120-Processing sheet'!G158","v":0}]
[null,null,{"$f":"IF('B120-Processing sheet'!F158=\"\",\"\",\"LIST\")","v":""}]
[null,"F4 – 128",{"$f":"'B120-Processing sheet'!F159","v":0},null,{"$f":"'B120-Processing sheet'!G159","v":0}]
[null,null,{"$f":"IF('B120-Processing sheet'!F159=\"\",\"\",\"LIST\")","v":""}]
[null,"F5 – 129",{"$f":"'B120-Processing sheet'!F161","v":"Council records indicate the presence of other properties (businesses) within this complex which are likely to continue operating during the construction of the addition. Please provide details of barriers that will be provided to protect the public and restrict access sufficient to demonstrate compliance with the requirements of F5.\n\n13/07/17 - thank you for the response, however there is insufficient information to demonstrate protection of the public during works. Please show on drawings the presence of barrier fencing sufficient to prevent public access to site during construction."},null,{"$f":"'B120-Processing sheet'!$G$161","v":"Resolved"}]
[null,null,{"$f":"IF('B120-Processing sheet'!F161=\"\",\"\",\"LIST\")","v":"LIST"}]
[null,"F6 – 130",{"$f":"'B120-Processing sheet'!F163","v":0},null,{"$f":"'B120-Processing sheet'!$G$163","v":0}]
[null,null,{"$f":"IF('B120-Processing sheet'!F163=\"\",\"\",\"LIST\")","v":""}]
[null,"F7 – 131",{"$f":"'B120-Processing sheet'!F165","v":0},null,{"$f":"'B120-Processing sheet'!$G$165","v":0}]
[null,null,{"$f":"IF('B120-Processing sheet'!F165=\"\",\"\",\"LIST\")","v":""}]
[null,"F8 – 132",{"$f":"'B120-Processing sheet'!F167","v":0},null,{"$f":"'B120-Processing sheet'!G167","v":0}]
[null,null,{"$f":"IF('B120-Processing sheet'!F167=\"\",\"\",\"LIST\")","v":""}]
[null,"F8 – 133",{"$f":"'B120-Processing sheet'!F168","v":0},null,{"$f":"'B120-Processing sheet'!G168","v":0}]
[null,null,{"$f":"IF('B120-Processing sheet'!F168=\"\",\"\",\"LIST\")","v":""}]
[null,"F8 – 134",{"$f":"'B120-Processing sheet'!F169","v":0},null,{"$f":"'B120-Processing sheet'!G169","v":0}]
[null,null,{"$f":"IF('B120-Processing sheet'!F169=\"\",\"\",\"LIST\")","v":""}]
[null,"G1 – 135",{"$f":"'B120-Processing sheet'!F171","v":0},null,{"$f":"'B120-Processing sheet'!G171","v":0}]
[null,null,{"$f":"IF('B120-Processing sheet'!F171=\"\",\"\",\"LIST\")","v":""}]
[null,"G1 – 136",{"$f":"'B120-Processing sheet'!F172","v":0},null,{"$f":"'B120-Processing sheet'!G172","v":0}]
[null,null,{"$f":"IF('B120-Processing sheet'!F172=\"\",\"\",\"LIST\")","v":""}]
[null,"G1 – 137",{"$f":"'B120-Processing sheet'!F173","v":0},null,{"$f":"'B120-Processing sheet'!G173","v":0}]
[null,null,{"$f":"IF('B120-Processing sheet'!F173=\"\",\"\",\"LIST\")","v":""}]
[null,"G1 – 138",{"$f":"'B120-Processing sheet'!F174","v":0},null,{"$f":"'B120-Processing sheet'!G174","v":0}]
[null,null,{"$f":"IF('B120-Processing sheet'!F174=\"\",\"\",\"LIST\")","v":""}]
[null,"G2 – 139",{"$f":"'B120-Processing sheet'!F176","v":0},null,{"$f":"'B120-Processing sheet'!$G$176","v":0}]
[null,null,{"$f":"IF('B120-Processing sheet'!F176=\"\",\"\",\"LIST\")","v":""}]
[null,"G3 – 140",{"$f":"'B120-Processing sheet'!F178","v":0},null,{"$f":"'B120-Processing sheet'!G178","v":0}]
[null,null,{"$f":"IF('B120-Processing sheet'!F178=\"\",\"\",\"LIST\")","v":""}]
[null,"G3 – 141",{"$f":"'B120-Processing sheet'!F179","v":0},null,{"$f":"'B120-Processing sheet'!G179","v":0}]
[null,null,{"$f":"IF('B120-Processing sheet'!F179=\"\",\"\",\"LIST\")","v":""}]
[null,"G3 – 142",{"$f":"'B120-Processing sheet'!F180","v":0},null,{"$f":"'B120-Processing sheet'!G180","v":0}]
[null,null,{"$f":"IF('B120-Processing sheet'!F180=\"\",\"\",\"LIST\")","v":""}]
[null,"G3 – 143",{"$f":"'B120-Processing sheet'!F181","v":0},null,{"$f":"'B120-Processing sheet'!G181","v":0}]
[null,null,{"$f":"IF('B120-Processing sheet'!F181=\"\",\"\",\"LIST\")","v":""}]
[null,"G3 – 144",{"$f":"'B120-Processing sheet'!F182","v":0},null,{"$f":"'B120-Processing sheet'!G182","v":0}]
[null,null,{"$f":"IF('B120-Processing sheet'!F182=\"\",\"\",\"LIST\")","v":""}]
[null,"G4 – 145",{"$f":"'B120-Processing sheet'!F184","v":0},null,{"$f":"'B120-Processing sheet'!G184","v":0}]
[null,null,{"$f":"IF('B120-Processing sheet'!F184=\"\",\"\",\"LIST\")","v":""}]
[null,"G4 – 146",{"$f":"'B120-Processing sheet'!F185","v":0},null,{"$f":"'B120-Processing sheet'!G185","v":0}]
[null,null,{"$f":"IF('B120-Processing sheet'!F185=\"\",\"\",\"LIST\")","v":""}]
[null,"G4 – 147",{"$f":"'B120-Processing sheet'!F186","v":0},null,{"$f":"'B120-Processing sheet'!G186","v":0}]
[null,null,{"$f":"IF('B120-Processing sheet'!F186=\"\",\"\",\"LIST\")","v":""}]
[null,"G4 – 148",{"$f":"'B120-Processing sheet'!F187","v":0},null,{"$f":"'B120-Processing sheet'!G187","v":0}]
[null,null,{"$f":"IF('B120-Processing sheet'!F187=\"\",\"\",\"LIST\")","v":""}]
[null,"G4 – 149",{"$f":"'B120-Processing sheet'!F188","v":0},null,{"$f":"'B120-Processing sheet'!G188","v":0}]
[null,null,{"$f":"IF('B120-Processing sheet'!F188=\"\",\"\",\"LIST\")","v":""}]
[null,"G5 – 150",{"$f":"'B120-Processing sheet'!F190","v":0},null,{"$f":"'B120-Processing sheet'!G190","v":0}]
[null,null,{"$f":"IF('B120-Processing sheet'!F190=\"\",\"\",\"LIST\")","v":""}]
[null,"G5 – 151",{"$f":"'B120-Processing sheet'!F191","v":0},null,{"$f":"'B120-Processing sheet'!G191","v":0}]
[null,null,{"$f":"IF('B120-Processing sheet'!F191=\"\",\"\",\"LIST\")","v":""}]
[null,"G5 – 152",{"$f":"'B120-Processing sheet'!F192","v":0},null,{"$f":"'B120-Processing sheet'!G192","v":0}]
[null,null,{"$f":"IF('B120-Processing sheet'!F192=\"\",\"\",\"LIST\")","v":""}]
[null,"G6 – 153",{"$f":"'B120-Processing sheet'!F194","v":0},null,{"$f":"'B120-Processing sheet'!G194","v":0}]
[null,null,{"$f":"IF('B120-Processing sheet'!F194=\"\",\"\",\"LIST\")","v":""}]
[null,"G6 – 154",{"$f":"'B120-Processing sheet'!F195","v":0},null,{"$f":"'B120-Processing sheet'!G195","v":0}]
[null,null,{"$f":"IF('B120-Processing sheet'!F195=\"\",\"\",\"LIST\")","v":""}]
[null,"G7 – 155",{"$f":"'B120-Processing sheet'!F197","v":0},null,{"$f":"'B120-Processing sheet'!G197","v":0}]
[null,null,{"$f":"IF('B120-Processing sheet'!F197=\"\",\"\",\"LIST\")","v":""}]
[null,"G7 – 156",{"$f":"'B120-Processing sheet'!F198","v":0},null,{"$f":"'B120-Processing sheet'!G198","v":0}]
[null,null,{"$f":"IF('B120-Processing sheet'!F198=\"\",\"\",\"LIST\")","v":""}]
[null,"G8 – 157",{"$f":"'B120-Processing sheet'!F200","v":0},null,{"$f":"'B120-Processing sheet'!G200","v":0}]
[null,null,{"$f":"IF('B120-Processing sheet'!F200=\"\",\"\",\"LIST\")","v":""}]
[null,"G9 – 158",{"$f":"'B120-Processing sheet'!F202","v":0},null,{"$f":"'B120-Processing sheet'!G202","v":0}]
[null,null,{"$f":"IF('B120-Processing sheet'!F202=\"\",\"\",\"LIST\")","v":""}]
[null,"G9 – 159",{"$f":"'B120-Processing sheet'!F203","v":0},null,{"$f":"'B120-Processing sheet'!G203","v":0}]
[null,null,{"$f":"IF('B120-Processing sheet'!F203=\"\",\"\",\"LIST\")","v":""}]
[null,"G9 – 160",{"$f":"'B120-Processing sheet'!F204","v":0},null,{"$f":"'B120-Processing sheet'!G204","v":0}]
[null,null,{"$f":"IF('B120-Processing sheet'!F204=\"\",\"\",\"LIST\")","v":""}]
[null,"G10 - 161",{"$f":"'B120-Processing sheet'!F206","v":0},null,{"$f":"'B120-Processing sheet'!G206","v":0}]
[null,null,{"$f":"IF('B120-Processing sheet'!F206=\"\",\"\",\"LIST\")","v":""}]
[null,"G10 - 162",{"$f":"'B120-Processing sheet'!F207","v":"Please revise the standard referenced on sheet A8 in relation to the gas supply. The current standard for gas installation is AS/NZS5601:2013."},null,{"$f":"'B120-Processing sheet'!G207","v":"Resolved"}]
[null,null,{"$f":"IF('B120-Processing sheet'!F207=\"\",\"\",\"LIST\")","v":"LIST"}]
[null,"G12 – 163",{"$f":"'B120-Processing sheet'!F209","v":0},null,{"$f":"'B120-Processing sheet'!G209","v":0}]
[null,null,{"$f":"IF('B120-Processing sheet'!F209=\"\",\"\",\"LIST\")","v":""}]
[null,"G12 – 164",{"$f":"'B120-Processing sheet'!F210","v":0},null,{"$f":"'B120-Processing sheet'!G210","v":0}]
[null,null,{"$f":"IF('B120-Processing sheet'!F210=\"\",\"\",\"LIST\")","v":""}]
[null,"G12 – 165",{"$f":"'B120-Processing sheet'!F211","v":"Council records show this property to be industrial, however there are no records indicating the presence of backflow prevention device. The Council waters department requires all commercial properties to have a backflow prevention device at the boundary to protect the network water supply. Installation of the backflow preventor requires a building consent. Please advise if you would like to increase to scope to include the installation of a backflow prevention device, if so all supporting documentation identifying type and model will also be required."},null,{"$f":"'B120-Processing sheet'!G211","v":"Resolved"}]
[null,null,{"$f":"IF('B120-Processing sheet'!F211=\"\",\"\",\"LIST\")","v":"LIST"}]
[null,"G12 – 166",{"$f":"'B120-Processing sheet'!F212","v":0},null,{"$f":"'B120-Processing sheet'!G212","v":0}]
[null,null,{"$f":"IF('B120-Processing sheet'!F212=\"\",\"\",\"LIST\")","v":""}]
[null,"G12 – 167",{"$f":"'B120-Processing sheet'!F213","v":0},null,{"$f":"'B120-Processing sheet'!G213","v":0}]
[null,null,{"$f":"IF('B120-Processing sheet'!F213=\"\",\"\",\"LIST\")","v":""}]
[null,"G12 – 168",{"$f":"'B120-Processing sheet'!F214","v":0},null,{"$f":"'B120-Processing sheet'!G214","v":0}]
[null,null,{"$f":"IF('B120-Processing sheet'!F214=\"\",\"\",\"LIST\")","v":""}]
[null,"G12 – 169",{"$f":"'B120-Processing sheet'!F215","v":0},null,{"$f":"'B120-Processing sheet'!G215","v":0}]
[null,null,{"$f":"IF('B120-Processing sheet'!F215=\"\",\"\",\"LIST\")","v":""}]
[null,"G13 – 170",{"$f":"'B120-Processing sheet'!F217","v":"Please review the plumbing design taking into consideration that AS3500 requires all drains within slabs to be minimum of 65mm diameter."},null,{"$f":"'B120-Processing sheet'!G217","v":"Resolved"}]
[null,null,{"$f":"IF('B120-Processing sheet'!F217=\"\",\"\",\"LIST\")","v":"LIST"}]
[null,"G13 – 171",{"$f":"'B120-Processing sheet'!F218","v":"1. The plumbing plan indicates the presence of two existing inspection bends (IB) for the existing sewer pipe. Please review the requirement and if necessary provide sufficient details to demonstrate that these can be maintained to demonstrate compliance with the requirements of AS3500.\n\n2. Please review the location of inspection points for the existing wastewater connection - note at least one required outside the edge of building."},null,{"$f":"'B120-Processing sheet'!G218","v":"Resolved"}]
[null,null,{"$f":"IF('B120-Processing sheet'!F218=\"\",\"\",\"LIST\")","v":"LIST"}]
[null,"G13 – 172",{"$f":"'B120-Processing sheet'!F219","v":"Please provide sufficient information to demonstrate compliance with the requirements of AS3500 in relation to implications of trenches close to building and drains under buildings."},null,{"$f":"'B120-Processing sheet'!G219","v":"Resolved"}]
[null,null,{"$f":"IF('B120-Processing sheet'!F219=\"\",\"\",\"LIST\")","v":"LIST"}]
[null,"G13 – 173",{"$f":"'B120-Processing sheet'!F220","v":0},null,{"$f":"'B120-Processing sheet'!G220","v":0}]
[null,null,{"$f":"IF('B120-Processing sheet'!F220=\"\",\"\",\"LIST\")","v":""}]
[null,"G13 – 174",{"$f":"'B120-Processing sheet'!F221","v":0},null,{"$f":"'B120-Processing sheet'!G221","v":0}]
[null,null,{"$f":"IF('B120-Processing sheet'!F221=\"\",\"\",\"LIST\")","v":""}]
[null,"G13 – 175",{"$f":"'B120-Processing sheet'!F222","v":0},null,{"$f":"'B120-Processing sheet'!G222","v":0}]
[null,null,{"$f":"IF('B120-Processing sheet'!F222=\"\",\"\",\"LIST\")","v":""}]
[null,"G13 – 176",{"$f":"'B120-Processing sheet'!F223","v":0},null,{"$f":"'B120-Processing sheet'!G223","v":0}]
[null,null,{"$f":"IF('B120-Processing sheet'!F223=\"\",\"\",\"LIST\")","v":""}]
[null,"G14 – 177",{"$f":"'B120-Processing sheet'!F225","v":0},null,{"$f":"'B120-Processing sheet'!G225","v":0}]
[null,null,{"$f":"IF('B120-Processing sheet'!F225=\"\",\"\",\"LIST\")","v":""}]
[null,"G15 – 178",{"$f":"'B120-Processing sheet'!F227","v":0},null,{"$f":"'B120-Processing sheet'!G227","v":0}]
[null,null,{"$f":"IF('B120-Processing sheet'!F227=\"\",\"\",\"LIST\")","v":""}]
[null,"H1 – 179",{"$f":"'B120-Processing sheet'!F229","v":0},null,{"$f":"'B120-Processing sheet'!G229","v":0}]
[null,null,{"$f":"IF('B120-Processing sheet'!F229=\"\",\"\",\"LIST\")","v":""}]
[null,"H1 – 180",{"$f":"'B120-Processing sheet'!F230","v":"1. Please provide details of the extent of conditioned space for the new addition taking into consideration the opening between the new and existing building sufficient to demonstrate compliance with the requirements of H1.\n\n2. Please review the H1 calculations provided. The reference heat loss for the vertical glazing appears excessive in relation to the proposed vertical glazing."},null,{"$f":"'B120-Processing sheet'!G230","v":"Resolved"}]
[null,null,{"$f":"IF('B120-Processing sheet'!F230=\"\",\"\",\"LIST\")","v":"LIST"}]
[null,"H1 – 181",{"$f":"'B120-Processing sheet'!F231","v":0},null,{"$f":"'B120-Processing sheet'!G231","v":0}]
[null,null,{"$f":"IF('B120-Processing sheet'!F231=\"\",\"\",\"LIST\")","v":""}]
[null,"H1 – 182",{"$f":"'B120-Processing sheet'!F232","v":0},null,{"$f":"'B120-Processing sheet'!G232","v":0}]
[null,null,{"$f":"IF('B120-Processing sheet'!F232=\"\",\"\",\"LIST\")","v":""}]
[null,"CS - 183",{"$f":"'B120-Processing sheet'!F234","v":0},null,{"$f":"'B120-Processing sheet'!G234","v":0}]
[null,null,{"$f":"IF('B120-Processing sheet'!F234=\"\",\"\",\"LIST\")","v":""}]
[null,"CS  - 184",{"$f":"'B120-Processing sheet'!F235","v":0},null,{"$f":"'B120-Processing sheet'!G235","v":0}]
[null,null,{"$f":"IF('B120-Processing sheet'!F235=\"\",\"\",\"LIST\")","v":""}]
[null,"CM - 185",{"$f":"'B120-Processing sheet'!F237","v":0},null,{"$f":"'B120-Processing sheet'!G237","v":0}]
[null,null,{"$f":"IF('B120-Processing sheet'!F237=\"\",\"\",\"LIST\")","v":""}]
[null,"CM - 186",{"$f":"'B120-Processing sheet'!F238","v":0},null,{"$f":"'B120-Processing sheet'!G238","v":0}]
[null,null,{"$f":"IF('B120-Processing sheet'!F238=\"\",\"\",\"LIST\")","v":""}]
[null,"OT - 187",{"$f":"'B120-Processing sheet'!F240","v":0},null,{"$f":"'B120-Processing sheet'!G240","v":0}]
[null,null,{"$f":"IF('B120-Processing sheet'!F240=\"\",\"\",\"LIST\")","v":""}]
[null,"OT - 188",{"$f":"'B120-Processing sheet'!F241","v":0},null,{"$f":"'B120-Processing sheet'!G241","v":0}]
[null,null,{"$f":"IF('B120-Processing sheet'!F241=\"\",\"\",\"LIST\")","v":""}]
[null,"HAZ - 001",{"$f":"'S71-74 natural hazards'!$F$18","v":0},null,{"$f":"'S71-74 natural hazards'!$G$18","v":0}]
[null,null,{"$f":"IF('S71-74 natural hazards'!F18=\"\",\"\",\"LIST\")","v":""}]
[null,"HAZ - 002",{"$f":"'S71-74 natural hazards'!$F$19","v":0},null,{"$f":"'S71-74 natural hazards'!$G$19","v":0}]
[null,null,{"$f":"IF('S71-74 natural hazards'!F19=\"\",\"\",\"LIST\")","v":""}]
[null,"HAZ - 003",{"$f":"'S71-74 natural hazards'!$F$20","v":0},null,{"$f":"'S71-74 natural hazards'!$G$20","v":0}]
[null,null,{"$f":"IF('S71-74 natural hazards'!F20=\"\",\"\",\"LIST\")","v":""}]
[null,"HAZ - 004",{"$f":"'S71-74 natural hazards'!$F$21","v":0},null,{"$f":"'S71-74 natural hazards'!$G$21","v":0}]
[null,null,{"$f":"IF('S71-74 natural hazards'!F21=\"\",\"\",\"LIST\")","v":""}]
[null,"HAZ - 005",{"$f":"'S71-74 natural hazards'!$F$22","v":0},null,{"$f":"'S71-74 natural hazards'!$G$22","v":0}]
[null,null,{"$f":"IF('S71-74 natural hazards'!F22=\"\",\"\",\"LIST\")","v":""}]
[null,"HAZ - 006",{"$f":"'S71-74 natural hazards'!$F$23","v":0},null,{"$f":"'S71-74 natural hazards'!$G$23","v":0}]
[null,null,{"$f":"IF('S71-74 natural hazards'!F23=\"\",\"\",\"LIST\")","v":""}]
[null,"HAZ - 007",{"$f":"'S71-74 natural hazards'!$F$24","v":0},null,{"$f":"'S71-74 natural hazards'!$G$24","v":0}]
[null,null,{"$f":"IF('S71-74 natural hazards'!F24=\"\",\"\",\"LIST\")","v":""}]
[null,"HAZ - 008",{"$f":"'S71-74 natural hazards'!$F$25","v":0},null,{"$f":"'S71-74 natural hazards'!$G$25","v":0}]
[null,null,{"$f":"IF('S71-74 natural hazards'!F25=\"\",\"\",\"LIST\")","v":""}]
[null,"HAZ - 009",{"$f":"'S71-74 natural hazards'!$F$26","v":0},null,{"$f":"'S71-74 natural hazards'!$G$26","v":0}]
[null,null,{"$f":"IF('S71-74 natural hazards'!F26=\"\",\"\",\"LIST\")","v":""}]
[null,"HAZ - 010",{"$f":"'S71-74 natural hazards'!$F$27","v":0},null,{"$f":"'S71-74 natural hazards'!$G$27","v":0}]
[null,null,{"$f":"IF('S71-74 natural hazards'!F27=\"\",\"\",\"LIST\")","v":""}]
[null,null,{"$f":"IF('B150-Structural specialist '!F22=\"\",\"\",'B150-Structural specialist '!L28)","v":"Specialist Review : Geotechnical  (Margaret Stoffel)"}]
[null,"GEO - 001",{"$f":"'B150-Structural specialist '!F22","v":"a) please provide Engco geotechnical report for 83 Byron St. ADDED 13/7/17 report not provided; please provide ENGCO report. ADDED 31/7/17: Please provide results of CPT and CPTu site investigation. RESOLVED 15/8/17\n\na2) ADDED 31/7/17: The Engco report for 83 Byron St indicates potential liquefaction induced settlement up to 100mm for SLS and up to 165mm for ULS are possible. Please clarify that this has been considered in design of the slab footing for 80 Byron St extension. 15/8/17: WITHDRAWN\n\nb) Please compare foundation for existing building to the foundation for the proposed extension since the two will be structurally connected. WITHDRAWN  13/7/17\n\nc) Specification section 2.4.1 Excavation states: “Below slabs on ground the general intent is to excavate to a stable undisturbed subgrade (of 300kPa ultimate bearing capacity).” This is inconsistent with the PS1 and the geotechnical letter which indicate the foundation was designed for a safe bearing of 50kPa (which I understand to be equivalent to an ultimate bearing capacity of 150kPa which was recommended by the geotechnical letter). Please amend specification. RESOLVED 13/7/2013\n\nd) Specification section 2.4.1 Excavation also states “As soon as excavation and filling is complete foundation material will be inspected by the Architect…”. Please amend specification for foundation subgrade to be verified by the geotechnical engineer. RESOLVED 13/7/2013\n\ne) Specification section 2.4.2 Hardfill & Blinding states “Hardfill under slabs on grade shall be 150mm of standard TNZ AP40 basecourse…”  The geotechnical letter recommends a 300mm thick layer of AP65 below the concrete slab if placed on organic fill with UBC 150kPa, with geotextile (Bidim A19 or equal) on base & sides of excavation, geogrid (Cirtex Duragrid 30/30 or equal) over the textile; extending beyond the building footprint a distance equal to the depth of the gravel. Please address why geotechnical recommendations were not followed. RESOLVED 13/7/2013\n\n"},null,{"$f":"'B150-Structural specialist '!G22","v":"RESOLVED"}]
[null,null,{"$f":"IF('B150-Structural specialist '!F22=\"\",\"\",\"LIST\")","v":"LIST"}]
[null,"GEO - 001A",{"$f":"'B150-Structural specialist '!F23","v":"f) The geotechnical letter also recommends that where it is not possible to extend the gravel layer beyond the building footprint on the South & West sides of the building because the site boundary does not does not provide adequate space, a new slab section must be designed. Please address this issue. ADDED 13/7/17: Response revers to structural calculations; this does not answer the question. Please indicate where this information is found. 31/7/17: no response provided RESOLVED 15/8/17"},null,{"$f":"'B150-Structural specialist '!G23","v":0}]
[null,null,{"$f":"IF('B150-Structural specialist '!F23=\"\",\"\",\"LIST\")","v":"LIST"}]
[null,null,{"$f":"IF('B150-Structural specialist '!K39>1,'B150-Structural specialist '!M33,\"\")","v":""}]
[null,"STR -002",{"$f":"'B150-Structural specialist '!F25","v":0},null,{"$f":"'B150-Structural specialist '!G25","v":0}]
[null,null,{"$f":"IF('B150-Structural specialist '!F25=\"\",\"\",\"LIST\")","v":""}]
[null,"STR -003",{"$f":"'B150-Structural specialist '!F26","v":0},null,{"$f":"'B150-Structural specialist '!G26","v":0}]
[null,null,{"$f":"IF('B150-Structural specialist '!F26=\"\",\"\",\"LIST\")","v":""}]
[null,"STR -004",{"$f":"'B150-Structural specialist '!F27","v":0},null,{"$f":"'B150-Structural specialist '!G27","v":0}]
[null,null,{"$f":"IF('B150-Structural specialist '!F27=\"\",\"\",\"LIST\")","v":""}]
[null,"STR -005",{"$f":"'B150-Structural specialist '!F29","v":0},null,{"$f":"'B150-Structural specialist '!G29","v":0}]
[null,null,{"$f":"IF('B150-Structural specialist '!F29=\"\",\"\",\"LIST\")","v":""}]
[null,"STR -006",{"$f":"'B150-Structural specialist '!F31","v":0},null,{"$f":"'B150-Structural specialist '!G31","v":0}]
[null,null,{"$f":"IF('B150-Structural specialist '!F31=\"\",\"\",\"LIST\")","v":""}]
[null,"STR -007",{"$f":"'B150-Structural specialist '!F32","v":0},null,{"$f":"'B150-Structural specialist '!G32","v":0}]
[null,null,{"$f":"IF('B150-Structural specialist '!F32=\"\",\"\",\"LIST\")","v":""}]
[null,"STR -008",{"$f":"'B150-Structural specialist '!F33","v":0},null,{"$f":"'B150-Structural specialist '!G33","v":0}]
[null,null,{"$f":"IF('B150-Structural specialist '!F33=\"\",\"\",\"LIST\")","v":""}]
[null,"STR -009",{"$f":"'B150-Structural specialist '!F34","v":0},null,{"$f":"'B150-Structural specialist '!G34","v":0}]
[null,null,{"$f":"IF('B150-Structural specialist '!F34=\"\",\"\",\"LIST\")","v":""}]
[null,"STR -010",{"$f":"'B150-Structural specialist '!F36","v":0},null,{"$f":"'B150-Structural specialist '!G36","v":0}]
[null,null,{"$f":"IF('B150-Structural specialist '!F36=\"\",\"\",\"LIST\")","v":""}]
[null,"STR -010A",{"$f":"'B150-Structural specialist '!F37","v":0},null,{"$f":"'B150-Structural specialist '!G37","v":0}]
[null,null,{"$f":"IF('B150-Structural specialist '!F37=\"\",\"\",\"LIST\")","v":""}]
[null,null,{"$f":"IF('B151a-Fire safety specialist'!K72>1,'B151a-Fire safety specialist'!M70,\"\")","v":"Specialist Review : Fire  (Adrienne Slattery (Jonathan Nyman from 13/7/2017))"}]
[null,"FIR - 001",{"$f":"'B151a-Fire safety specialist'!F15","v":0},null,{"$f":"'B151a-Fire safety specialist'!G15","v":0}]
[null,null,{"$f":"IF('B151a-Fire safety specialist'!F15=\"\",\"\",\"LIST\")","v":""}]
[null,"FIR - 002",{"$f":"'B151a-Fire safety specialist'!F16","v":0},null,{"$f":"'B151a-Fire safety specialist'!G16","v":0}]
[null,null,{"$f":"IF('B151a-Fire safety specialist'!F16=\"\",\"\",\"LIST\")","v":""}]
[null,"FIR - 003",{"$f":"'B151a-Fire safety specialist'!F18","v":0},null,{"$f":"'B151a-Fire safety specialist'!G18","v":0}]
[null,null,{"$f":"IF('B151a-Fire safety specialist'!F18=\"\",\"\",\"LIST\")","v":""}]
[null,"FIR - 004",{"$f":"'B151a-Fire safety specialist'!F19","v":0},null,{"$f":"'B151a-Fire safety specialist'!G19","v":0}]
[null,null,{"$f":"IF('B151a-Fire safety specialist'!F19=\"\",\"\",\"LIST\")","v":""}]
[null,"FIR - 005",{"$f":"'B151a-Fire safety specialist'!F20","v":"The existing use listed on the compliance schedule is WL FHC2 and the building in part is provided with sprinkler coverage. Please reassess the building and update the fire report to reflect the change of use occuring and specified systems within the building. We cannot amend the compliance schedule without further information provided on the sprinkler system. \nADDED 13/7/2017 - Response noted.  As previously advised the existing Compliance Schedule (CS) states the building Purpose Group as WL, and that the building has some form of sprinkler protection.  The fire design proposes the building is to be used for workshop with storage to 3m which would change the use to WM Purpose Group. Consideration of such a Change of Use, and any building deletion of sprinklers from the CS and it's impact on neighbouring property protection as applicable is required."},null,{"$f":"'B151a-Fire safety specialist'!G20","v":"Resolved"}]
[null,null,{"$f":"IF('B151a-Fire safety specialist'!F20=\"\",\"\",\"LIST\")","v":"LIST"}]
[null,"FIR - 006",{"$f":"'B151a-Fire safety specialist'!F21","v":0},null,{"$f":"'B151a-Fire safety specialist'!G21","v":0}]
[null,null,{"$f":"IF('B151a-Fire safety specialist'!F21=\"\",\"\",\"LIST\")","v":""}]
[null,"FIR - 007",{"$f":"'B151a-Fire safety specialist'!F22","v":0},null,{"$f":"'B151a-Fire safety specialist'!G22","v":0}]
[null,null,{"$f":"IF('B151a-Fire safety specialist'!F22=\"\",\"\",\"LIST\")","v":""}]
[null,"FIR - 008",{"$f":"'B151a-Fire safety specialist'!F23","v":0},null,{"$f":"'B151a-Fire safety specialist'!G23","v":0}]
[null,null,{"$f":"IF('B151a-Fire safety specialist'!F23=\"\",\"\",\"LIST\")","v":""}]
[null,"FIR - 009",{"$f":"'B151a-Fire safety specialist'!F24","v":0},null,{"$f":"'B151a-Fire safety specialist'!G24","v":0}]
[null,null,{"$f":"IF('B151a-Fire safety specialist'!F24=\"\",\"\",\"LIST\")","v":""}]
[null,"FIR - 010",{"$f":"'B151a-Fire safety specialist'!F25","v":"As this application meets the criteria in NEW ZEALAND GAZETTE, No. 49  under 'Notice that Copies of Certain Applications for Building Consent Must be Provided to the New Zealand Fire Service Commission', the application has been sent to NZFS for them to provide a memorandum in accordance with section 47 of the Building Act. Once we receive their memorandum we will give regard to the memorandum and send to you for your response.\nADDED 21/04/2017 Please address the issues raised in the attached memo from the NZFS. \nADDED 13/7/2017 - Response to NZFS DRU memo, issued 21/4/2017, is still awaited. Memo is re-attached for use."},null,{"$f":"'B151a-Fire safety specialist'!G25","v":"Resolved"}]
[null,null,{"$f":"IF('B151a-Fire safety specialist'!F25=\"\",\"\",\"LIST\")","v":"LIST"}]
[null,"FIR - 011",{"$f":"'B151a-Fire safety specialist'!F26","v":0},null,{"$f":"'B151a-Fire safety specialist'!G26","v":0}]
[null,null,{"$f":"IF('B151a-Fire safety specialist'!F26=\"\",\"\",\"LIST\")","v":""}]
[null,"FIR - 012",{"$f":"'B151a-Fire safety specialist'!F28","v":0},null,{"$f":"'B151a-Fire safety specialist'!G28","v":0}]
[null,null,{"$f":"IF('B151a-Fire safety specialist'!F28=\"\",\"\",\"LIST\")","v":""}]
[null,"FIR - 013",{"$f":"'B151a-Fire safety specialist'!F29","v":0},null,{"$f":"'B151a-Fire safety specialist'!G29","v":0}]
[null,null,{"$f":"IF('B151a-Fire safety specialist'!F29=\"\",\"\",\"LIST\")","v":""}]
[null,"FIR - 014",{"$f":"'B151a-Fire safety specialist'!F30","v":0},null,{"$f":"'B151a-Fire safety specialist'!G30","v":0}]
[null,null,{"$f":"IF('B151a-Fire safety specialist'!F30=\"\",\"\",\"LIST\")","v":""}]
[null,"FIR - 015",{"$f":"'B151a-Fire safety specialist'!F31","v":0},null,{"$f":"'B151a-Fire safety specialist'!G31","v":0}]
[null,null,{"$f":"IF('B151a-Fire safety specialist'!F31=\"\",\"\",\"LIST\")","v":""}]
[null,"FIR - 016",{"$f":"'B151a-Fire safety specialist'!F32","v":0},null,{"$f":"'B151a-Fire safety specialist'!G32","v":0}]
[null,null,{"$f":"IF('B151a-Fire safety specialist'!F32=\"\",\"\",\"LIST\")","v":""}]
[null,"FIR - 017",{"$f":"'B151a-Fire safety specialist'!F33","v":0},null,{"$f":"'B151a-Fire safety specialist'!G33","v":0}]
[null,null,{"$f":"IF('B151a-Fire safety specialist'!F33=\"\",\"\",\"LIST\")","v":""}]
[null,"FIR - 018",{"$f":"'B151a-Fire safety specialist'!F34","v":0},null,{"$f":"'B151a-Fire safety specialist'!G34","v":0}]
[null,null,{"$f":"IF('B151a-Fire safety specialist'!F34=\"\",\"\",\"LIST\")","v":""}]
[null,"FIR - 019",{"$f":"'B151a-Fire safety specialist'!F35","v":0},null,{"$f":"'B151a-Fire safety specialist'!G35","v":0}]
[null,null,{"$f":"IF('B151a-Fire safety specialist'!F35=\"\",\"\",\"LIST\")","v":""}]
[null,"FIR - 020",{"$f":"'B151a-Fire safety specialist'!F36","v":0},null,{"$f":"'B151a-Fire safety specialist'!G36","v":0}]
[null,null,{"$f":"IF('B151a-Fire safety specialist'!F36=\"\",\"\",\"LIST\")","v":""}]
[null,"FIR - 021",{"$f":"'B151a-Fire safety specialist'!F37","v":0},null,{"$f":"'B151a-Fire safety specialist'!G37","v":0}]
[null,null,{"$f":"IF('B151a-Fire safety specialist'!F37=\"\",\"\",\"LIST\")","v":""}]
[null,"FIR - 022",{"$f":"'B151a-Fire safety specialist'!F38","v":0},null,{"$f":"'B151a-Fire safety specialist'!G38","v":0}]
[null,null,{"$f":"IF('B151a-Fire safety specialist'!F38=\"\",\"\",\"LIST\")","v":""}]
[null,"FIR - 023",{"$f":"'B151a-Fire safety specialist'!F39","v":0},null,{"$f":"'B151a-Fire safety specialist'!G39","v":0}]
[null,null,{"$f":"IF('B151a-Fire safety specialist'!F39=\"\",\"\",\"LIST\")","v":""}]
[null,"FIR - 024",{"$f":"'B151a-Fire safety specialist'!F41","v":0},null,{"$f":"'B151a-Fire safety specialist'!G41","v":0}]
[null,null,{"$f":"IF('B151a-Fire safety specialist'!F41=\"\",\"\",\"LIST\")","v":""}]
[null,"FIR - 025",{"$f":"'B151a-Fire safety specialist'!F42","v":"Please provide further justification for the occupant load density for the workshop area and please update the fire report."},null,{"$f":"'B151a-Fire safety specialist'!G42","v":"Resolved"}]
[null,null,{"$f":"IF('B151a-Fire safety specialist'!F42=\"\",\"\",\"LIST\")","v":"LIST"}]
[null,"FIR - 026",{"$f":"'B151a-Fire safety specialist'!F43","v":0},null,{"$f":"'B151a-Fire safety specialist'!G43","v":0}]
[null,null,{"$f":"IF('B151a-Fire safety specialist'!F43=\"\",\"\",\"LIST\")","v":""}]
[null,"FIR - 027",{"$f":"'B151a-Fire safety specialist'!F44","v":0},null,{"$f":"'B151a-Fire safety specialist'!G44","v":0}]
[null,null,{"$f":"IF('B151a-Fire safety specialist'!F44=\"\",\"\",\"LIST\")","v":""}]
[null,"FIR - 028",{"$f":"'B151a-Fire safety specialist'!F45","v":0},null,{"$f":"'B151a-Fire safety specialist'!G45","v":0}]
[null,null,{"$f":"IF('B151a-Fire safety specialist'!F45=\"\",\"\",\"LIST\")","v":""}]
[null,"FIR - 029",{"$f":"'B151a-Fire safety specialist'!F46","v":0},null,{"$f":"'B151a-Fire safety specialist'!G46","v":0}]
[null,null,{"$f":"IF('B151a-Fire safety specialist'!F46=\"\",\"\",\"LIST\")","v":""}]
[null,"FIR - 030",{"$f":"'B151a-Fire safety specialist'!F47","v":0},null,{"$f":"'B151a-Fire safety specialist'!G47","v":0}]
[null,null,{"$f":"IF('B151a-Fire safety specialist'!F47=\"\",\"\",\"LIST\")","v":""}]
[null,"FIR - 031",{"$f":"'B151a-Fire safety specialist'!F48","v":"The fire report requirements include replacing key locks with snib locks. To demonstrate that the design is coordinated please provide a door hardware schedule as part of the architectural set of drawings. \nADDED 13/7/2017 - Fire engineer response noted.  Please provide the door schedule detailing the required new door locks to be provided for compliance."},null,{"$f":"'B151a-Fire safety specialist'!G48","v":"Resolved"}]
[null,null,{"$f":"IF('B151a-Fire safety specialist'!F48=\"\",\"\",\"LIST\")","v":"LIST"}]
[null,"FIR - 032",{"$f":"'B151a-Fire safety specialist'!F49","v":0},null,{"$f":"'B151a-Fire safety specialist'!G49","v":0}]
[null,null,{"$f":"IF('B151a-Fire safety specialist'!F49=\"\",\"\",\"LIST\")","v":""}]
[null,"FIR - 033",{"$f":"'B151a-Fire safety specialist'!F50","v":0},null,{"$f":"'B151a-Fire safety specialist'!G50","v":0}]
[null,null,{"$f":"IF('B151a-Fire safety specialist'!F50=\"\",\"\",\"LIST\")","v":""}]
[null,"FIR - 034",{"$f":"'B151a-Fire safety specialist'!F51","v":0},null,{"$f":"'B151a-Fire safety specialist'!G51","v":0}]
[null,null,{"$f":"IF('B151a-Fire safety specialist'!F51=\"\",\"\",\"LIST\")","v":""}]
[null,"FIR - 035",{"$f":"'B151a-Fire safety specialist'!F52","v":0},null,{"$f":"'B151a-Fire safety specialist'!G52","v":0}]
[null,null,{"$f":"IF('B151a-Fire safety specialist'!F52=\"\",\"\",\"LIST\")","v":""}]
[null,"FIR - 036",{"$f":"'B151a-Fire safety specialist'!F53","v":0},null,{"$f":"'B151a-Fire safety specialist'!G53","v":0}]
[null,null,{"$f":"IF('B151a-Fire safety specialist'!F53=\"\",\"\",\"LIST\")","v":""}]
[null,"FIR - 037",{"$f":"'B151a-Fire safety specialist'!F54","v":"The fire report states that the wall and ceiling linings in the new office extension is painted plasterboard, however it appears that plywood is noted. Please update the fire report / architectural plans as applicable to demonstrate that the design has been coordinated. "},null,{"$f":"'B151a-Fire safety specialist'!G54","v":"Resolved"}]
[null,null,{"$f":"IF('B151a-Fire safety specialist'!F54=\"\",\"\",\"LIST\")","v":"LIST"}]
[null,"FIR - 038",{"$f":"'B151a-Fire safety specialist'!F55","v":0},null,{"$f":"'B151a-Fire safety specialist'!G55","v":0}]
[null,null,{"$f":"IF('B151a-Fire safety specialist'!F55=\"\",\"\",\"LIST\")","v":""}]
[null,"FIR - 039",{"$f":"'B151a-Fire safety specialist'!F56","v":0},null,{"$f":"'B151a-Fire safety specialist'!G56","v":0}]
[null,null,{"$f":"IF('B151a-Fire safety specialist'!F56=\"\",\"\",\"LIST\")","v":""}]
[null,"FIR - 040",{"$f":"'B151a-Fire safety specialist'!F57","v":0},null,{"$f":"'B151a-Fire safety specialist'!G57","v":0}]
[null,null,{"$f":"IF('B151a-Fire safety specialist'!F57=\"\",\"\",\"LIST\")","v":""}]
[null,"FIR - 041",{"$f":"'B151a-Fire safety specialist'!F59","v":0},null,{"$f":"'B151a-Fire safety specialist'!G59","v":0}]
[null,null,{"$f":"IF('B151a-Fire safety specialist'!F59=\"\",\"\",\"LIST\")","v":""}]
[null,"FIR - 042",{"$f":"'B151a-Fire safety specialist'!F60","v":0},null,{"$f":"'B151a-Fire safety specialist'!G60","v":0}]
[null,null,{"$f":"IF('B151a-Fire safety specialist'!F60=\"\",\"\",\"LIST\")","v":""}]
[null,"FIR - 043",{"$f":"'B151a-Fire safety specialist'!F61","v":0},null,{"$f":"'B151a-Fire safety specialist'!G61","v":0}]
[null,null,{"$f":"IF('B151a-Fire safety specialist'!F61=\"\",\"\",\"LIST\")","v":""}]
[null,"FIR - 044",{"$f":"'B151a-Fire safety specialist'!F62","v":"Please provide an emergency lighting design to demonstrate compliance with F6 of NZ Building Code as required in the Fire report. Please refer to paragraph 1.7 of F6/AS1 for the documentation you need to supply. Please provide full technical justification of the design and a PS1 from a CPEng engineer with assessed area being electrical engineering, or from a professional lighting consultant. \nADDED 13/7/2017 - Query outstanding"},null,{"$f":"'B151a-Fire safety specialist'!G62","v":"Resolved"}]
[null,null,{"$f":"IF('B151a-Fire safety specialist'!F62=\"\",\"\",\"LIST\")","v":"LIST"}]
[null,"FIR - 045",{"$f":"'B151a-Fire safety specialist'!F63","v":0},null,{"$f":"'B151a-Fire safety specialist'!G63","v":0}]
[null,null,{"$f":"IF('B151a-Fire safety specialist'!F63=\"\",\"\",\"LIST\")","v":""}]
[null,"FIR - 046",{"$f":"'B151a-Fire safety specialist'!F64","v":"We believe it is more appropriate for your emergency lighting designer to carry out the necessary inspections and provide a PS4 for the emergency lighting design at the completion of the project. Please confirm this is to be arranged.\nADDED 13/7/2017 - Query outstanding"},null,{"$f":"'B151a-Fire safety specialist'!G64","v":"Resolved"}]
[null,null,{"$f":"IF('B151a-Fire safety specialist'!F64=\"\",\"\",\"LIST\")","v":"LIST"}]
[null,"FIR - 047",{"$f":"'B151a-Fire safety specialist'!F65","v":0},null,{"$f":"'B151a-Fire safety specialist'!G65","v":0}]
[null,null,{"$f":"IF('B151a-Fire safety specialist'!F65=\"\",\"\",\"LIST\")","v":""}]
[null,"FIR - 048",{"$f":"'B151a-Fire safety specialist'!F67","v":0},null,{"$f":"'B151a-Fire safety specialist'!G67","v":0}]
[null,null,{"$f":"IF('B151a-Fire safety specialist'!F67=\"\",\"\",\"LIST\")","v":""}]
[null,"FIR - 049",{"$f":"'B151a-Fire safety specialist'!F68","v":0},null,{"$f":"'B151a-Fire safety specialist'!G68","v":0}]
[null,null,{"$f":"IF('B151a-Fire safety specialist'!F68=\"\",\"\",\"LIST\")","v":""}]
[null,"FIR - 050",{"$f":"'B151a-Fire safety specialist'!F69","v":0},null,{"$f":"'B151a-Fire safety specialist'!G69","v":0}]
[null,null,{"$f":"IF('B151a-Fire safety specialist'!F69=\"\",\"\",\"LIST\")","v":""}]
[null,"FIR - 051",{"$f":"'B151a-Fire safety specialist'!F70","v":0},null,{"$f":"'B151a-Fire safety specialist'!G70","v":0}]
[null,null,{"$f":"IF('B151a-Fire safety specialist'!F70=\"\",\"\",\"LIST\")","v":""}]
[null,"FIR - 052",{"$f":"'B151a-Fire safety specialist'!F71","v":0},null,{"$f":"'B151a-Fire safety specialist'!G71","v":0}]
[null,null,{"$f":"IF('B151a-Fire safety specialist'!F71=\"\",\"\",\"LIST\")","v":""}]
[null,null,{"$f":"IF('B151b-Fire safety specialist'!K40>1,'B151b-Fire safety specialist'!O38,\"\")","v":""}]
[null,"DPF - 001",{"$f":"'B151b-Fire safety specialist'!F22","v":0},null,{"$f":"'B151b-Fire safety specialist'!G22","v":0}]
[null,null,{"$f":"IF('B151b-Fire safety specialist'!F22=\"\",\"\",\"LIST\")","v":""}]
[null,"DPF - 002",{"$f":"'B151b-Fire safety specialist'!F23","v":0},null,{"$f":"'B151b-Fire safety specialist'!G23","v":0}]
[null,null,{"$f":"IF('B151b-Fire safety specialist'!F23=\"\",\"\",\"LIST\")","v":""}]
[null,"DPF - 003",{"$f":"'B151b-Fire safety specialist'!F25","v":0},null,{"$f":"'B151b-Fire safety specialist'!G25","v":0}]
[null,null,{"$f":"IF('B151b-Fire safety specialist'!F25=\"\",\"\",\"LIST\")","v":""}]
[null,"DPF - 004",{"$f":"'B151b-Fire safety specialist'!F27","v":0},null,{"$f":"'B151b-Fire safety specialist'!G27","v":0}]
[null,null,{"$f":"IF('B151b-Fire safety specialist'!F27=\"\",\"\",\"LIST\")","v":""}]
[null,"DPF - 005",{"$f":"'B151b-Fire safety specialist'!F28","v":0},null,{"$f":"'B151b-Fire safety specialist'!G28","v":0}]
[null,null,{"$f":"IF('B151b-Fire safety specialist'!F28=\"\",\"\",\"LIST\")","v":""}]
[null,"DPF - 006",{"$f":"'B151b-Fire safety specialist'!F29","v":0},null,{"$f":"'B151b-Fire safety specialist'!G29","v":0}]
[null,null,{"$f":"IF('B151b-Fire safety specialist'!F29=\"\",\"\",\"LIST\")","v":""}]
[null,"DPF - 007",{"$f":"'B151b-Fire safety specialist'!F30","v":0},null,{"$f":"'B151b-Fire safety specialist'!G30","v":0}]
[null,null,{"$f":"IF('B151b-Fire safety specialist'!F30=\"\",\"\",\"LIST\")","v":""}]
[null,"DPF - 008",{"$f":"'B151b-Fire safety specialist'!F31","v":0},null,{"$f":"'B151b-Fire safety specialist'!G31","v":0}]
[null,null,{"$f":"IF('B151b-Fire safety specialist'!F31=\"\",\"\",\"LIST\")","v":""}]
[null,"DPF - 009",{"$f":"'B151b-Fire safety specialist'!F32","v":0},null,{"$f":"'B151b-Fire safety specialist'!G32","v":0}]
[null,null,{"$f":"IF('B151b-Fire safety specialist'!F32=\"\",\"\",\"LIST\")","v":""}]
[null,"DPF - 010",{"$f":"'B151b-Fire safety specialist'!F33","v":0},null,{"$f":"'B151b-Fire safety specialist'!G33","v":0}]
[null,null,{"$f":"IF('B151b-Fire safety specialist'!F33=\"\",\"\",\"LIST\")","v":""}]
[null,"DPF - 011",{"$f":"'B151b-Fire safety specialist'!F34","v":0},null,{"$f":"'B151b-Fire safety specialist'!G34","v":0}]
[null,null,{"$f":"IF('B151b-Fire safety specialist'!F34=\"\",\"\",\"LIST\")","v":""}]
[null,"DPF - 012",{"$f":"'B151b-Fire safety specialist'!F35","v":0},null,{"$f":"'B151b-Fire safety specialist'!G35","v":0}]
[null,null,{"$f":"IF('B151b-Fire safety specialist'!F35=\"\",\"\",\"LIST\")","v":""}]
[null,"DPF - 013",{"$f":"'B151b-Fire safety specialist'!F36","v":0},null,{"$f":"'B151b-Fire safety specialist'!G36","v":0}]
[null,null,{"$f":"IF('B151b-Fire safety specialist'!F36=\"\",\"\",\"LIST\")","v":""}]
[null,"DPF - 014",{"$f":"'B151b-Fire safety specialist'!F37","v":0},null,{"$f":"'B151b-Fire safety specialist'!G37","v":0}]
[null,null,{"$f":"IF('B151b-Fire safety specialist'!F37=\"\",\"\",\"LIST\")","v":""}]
[null,"DPF - 015",{"$f":"'B151b-Fire safety specialist'!F39","v":0},null,{"$f":"'B151b-Fire safety specialist'!G39","v":0}]
[null,null,{"$f":"IF('B151b-Fire safety specialist'!F39=\"\",\"\",\"LIST\")","v":""}]
[null,null,{"$f":"IF('B160-PS specialist'!N23>1,'B160-PS specialist'!T23,\"\")","v":"Specialist Review : Mechanical Ventilation  (Nick Waddington )"}]
[null,"SER - 001",{"$f":"'B160-PS specialist'!F21","v":"The specialist services reviewer of this application requires the following additional information:\n\nPlease provide PS1 (Design) and associated design details, showing Compliance with Clauses G4 and H1.3.6 of the New Zealand Building Code. Also, a schedule of inspections to be undertaken by the engineer with confirmation that 'as built' drawings and a PS4 will be provided on successful commissioning of the ventilation systems.                      Response received 12/7/17 does not address RFI                                            Response received 1/8/17 gives no indication of how internal office and meeting room are ventilated, does not give any extract rates for toilets and PS1 provided gives no indication that PS4 will be provided.\n"},null,{"$f":"'B160-PS specialist'!G21","v":"Resolved"}]
[null,null,{"$f":"IF('B160-PS specialist'!F21=\"\",\"\",\"LIST\")","v":"LIST"}]
[null,"SER - 002",{"$f":"'B160-PS specialist'!F22","v":0},null,{"$f":"'B160-PS specialist'!G22","v":0}]
[null,null,{"$f":"IF('B160-PS specialist'!F22=\"\",\"\",\"LIST\")","v":""}]
[null,"SER - 003",{"$f":"'B160-PS specialist'!F23","v":0},null,{"$f":"'B160-PS specialist'!G23","v":0}]
[null,null,{"$f":"IF('B160-PS specialist'!F23=\"\",\"\",\"LIST\")","v":""}]
[null,null,{"$f":"IF('B160-PS specialist'!N26>1,'B160-PS specialist'!P26,\"\")","v":""}]
[null,"SER - 004",{"$f":"'B160-PS specialist'!F25","v":0},null,{"$f":"'B160-PS specialist'!G25","v":0}]
[null,null,{"$f":"IF('B160-PS specialist'!F25=\"\",\"\",\"LIST\")","v":""}]
[null,"SER - 005",{"$f":"'B160-PS specialist'!F26","v":0},null,{"$f":"'B160-PS specialist'!G26","v":0}]
[null,null,{"$f":"IF('B160-PS specialist'!F26=\"\",\"\",\"LIST\")","v":""}]
[null,null,{"$f":"IF('B160-PS specialist'!N29>1,'B160-PS specialist'!P32,\"\")","v":""}]
[null,"SER - 006",{"$f":"'B160-PS specialist'!F28","v":0},null,{"$f":"'B160-PS specialist'!G28","v":0}]
[null,null,{"$f":"IF('B160-PS specialist'!F28=\"\",\"\",\"LIST\")","v":""}]
[null,"SER - 007",{"$f":"'B160-PS specialist'!F29","v":0},null,{"$f":"'B160-PS specialist'!G29","v":0}]
[null,null,{"$f":"IF('B160-PS specialist'!F29=\"\",\"\",\"LIST\")","v":""}]
[]
[]
[]
[]
[]
[null,"Yours sincerely"]
[null,null,"."]
[null,null,"."]
[null,null,"."]
[null,{"$f":"'Summary sheet'!E51","v":"Tania McGrath"}]
[null,{"$f":"'Summary sheet'!E52","v":"Building Consent Officer"}]